=> Bootstrap dependency digest>=20010302: found digest-20111104
=> Bootstrap dependency fetch-[0-9]*: found fetch-1.7
WARNING: [license.mk] Every package should define a LICENSE.
===> Building for bcollect-0.6.0
--- all ---
/usr/pkg/bin/bmake  all-recursive
--- all-recursive ---
Making all in include
Making all in confparser
--- conffuncs.o ---
--- confparser.c ---
--- conflexer.c ---
--- conffuncs.o ---
gcc -DHAVE_CONFIG_H -I. -I..    -I/usr/pkg/include -I../include  -O3 -pipe -fstack-protector -I/usr/pkg/include -MT conffuncs.o -MD -MP -MF .deps/conffuncs.Tpo -c -o conffuncs.o conffuncs.c
--- confparser.c ---
/bin/sh ../ylwrap confparser.y y.tab.c confparser.c y.tab.h confparser.h y.output confparser.output -- /usr/pkg/bin/bison -y -d 
--- conflexer.c ---
/bin/sh ../ylwrap conflexer.l lex.yy.c conflexer.c -- /usr/pkg/bin/flex  
--- conflexer.o ---
gcc -DHAVE_CONFIG_H -I. -I..    -I/usr/pkg/include -I../include  -O3 -pipe -fstack-protector -I/usr/pkg/include -MT conflexer.o -MD -MP -MF .deps/conflexer.Tpo -c -o conflexer.o conflexer.c
--- confparser.c ---
updating confparser.h
--- confparser.o ---
gcc -DHAVE_CONFIG_H -I. -I..    -I/usr/pkg/include -I../include  -O3 -pipe -fstack-protector -I/usr/pkg/include -MT confparser.o -MD -MP -MF .deps/confparser.Tpo -c -o confparser.o confparser.c
--- conffuncs.o ---
In file included from ../include/bcollect.h:93:0,
                 from conffuncs.c:32:
/tmp/pkgsrc/sysutils/bcollect/work/.buildlink/include/clib/clib.h:115:45: warning: 'struct sockaddr_storage' declared inside parameter list
/tmp/pkgsrc/sysutils/bcollect/work/.buildlink/include/clib/clib.h:115:45: warning: its scope is only this definition or declaration, which is probably not what you want
/tmp/pkgsrc/sysutils/bcollect/work/.buildlink/include/clib/clib.h:116:36: warning: 'struct sockaddr_storage' declared inside parameter list
--- conflexer.o ---
In file included from ../include/bcollect.h:93:0,
                 from conflexer.l:35:
/tmp/pkgsrc/sysutils/bcollect/work/.buildlink/include/clib/clib.h:115:45: warning: 'struct sockaddr_storage' declared inside parameter list
/tmp/pkgsrc/sysutils/bcollect/work/.buildlink/include/clib/clib.h:115:45: warning: its scope is only this definition or declaration, which is probably not what you want
/tmp/pkgsrc/sysutils/bcollect/work/.buildlink/include/clib/clib.h:116:36: warning: 'struct sockaddr_storage' declared inside parameter list
--- confparser.o ---
In file included from ../include/bcollect.h:93:0,
                 from confparser.y:35:
/tmp/pkgsrc/sysutils/bcollect/work/.buildlink/include/clib/clib.h:115:45: warning: 'struct sockaddr_storage' declared inside parameter list
/tmp/pkgsrc/sysutils/bcollect/work/.buildlink/include/clib/clib.h:115:45: warning: its scope is only this definition or declaration, which is probably not what you want
/tmp/pkgsrc/sysutils/bcollect/work/.buildlink/include/clib/clib.h:116:36: warning: 'struct sockaddr_storage' declared inside parameter list
--- conffuncs.o ---
mv -f .deps/conffuncs.Tpo .deps/conffuncs.Po
--- confparser.o ---
mv -f .deps/confparser.Tpo .deps/confparser.Po
--- conflexer.o ---
mv -f .deps/conflexer.Tpo .deps/conflexer.Po
--- libconfparser.a ---
rm -f libconfparser.a
ar cru libconfparser.a conffuncs.o confparser.o  conflexer.o 
ranlib libconfparser.a
Making all in examples
--- main.o ---
--- rmdir.o ---
--- backup.o ---
--- flock.o ---
--- rmfr.o ---
--- main.o ---
gcc -DHAVE_CONFIG_H -I.    -I/usr/pkg/include -I./include  -O3 -pipe -fstack-protector -I/usr/pkg/include -MT main.o -MD -MP -MF .deps/main.Tpo -c -o main.o main.c
--- rmdir.o ---
gcc -DHAVE_CONFIG_H -I.    -I/usr/pkg/include -I./include  -O3 -pipe -fstack-protector -I/usr/pkg/include -MT rmdir.o -MD -MP -MF .deps/rmdir.Tpo -c -o rmdir.o rmdir.c
--- backup.o ---
gcc -DHAVE_CONFIG_H -I.    -I/usr/pkg/include -I./include  -O3 -pipe -fstack-protector -I/usr/pkg/include -MT backup.o -MD -MP -MF .deps/backup.Tpo -c -o backup.o backup.c
--- flock.o ---
gcc -DHAVE_CONFIG_H -I.    -I/usr/pkg/include -I./include  -O3 -pipe -fstack-protector -I/usr/pkg/include -MT flock.o -MD -MP -MF .deps/flock.Tpo -c -o flock.o flock.c
--- rmfr.o ---
gcc -DHAVE_CONFIG_H -I.    -I/usr/pkg/include -I./include  -O3 -pipe -fstack-protector -I/usr/pkg/include -MT rmfr.o -MD -MP -MF .deps/rmfr.Tpo -c -o rmfr.o rmfr.c
mv -f .deps/rmfr.Tpo .deps/rmfr.Po
--- main.o ---
In file included from ./include/bcollect.h:93:0,
                 from main.c:1:
/tmp/pkgsrc/sysutils/bcollect/work/.buildlink/include/clib/clib.h:115:45: warning: 'struct sockaddr_storage' declared inside parameter list
/tmp/pkgsrc/sysutils/bcollect/work/.buildlink/include/clib/clib.h:115:45: warning: its scope is only this definition or declaration, which is probably not what you want
/tmp/pkgsrc/sysutils/bcollect/work/.buildlink/include/clib/clib.h:116:36: warning: 'struct sockaddr_storage' declared inside parameter list
--- backup.o ---
In file included from ./include/bcollect.h:93:0,
                 from backup.c:32:
/tmp/pkgsrc/sysutils/bcollect/work/.buildlink/include/clib/clib.h:115:45: warning: 'struct sockaddr_storage' declared inside parameter list
/tmp/pkgsrc/sysutils/bcollect/work/.buildlink/include/clib/clib.h:115:45: warning: its scope is only this definition or declaration, which is probably not what you want
/tmp/pkgsrc/sysutils/bcollect/work/.buildlink/include/clib/clib.h:116:36: warning: 'struct sockaddr_storage' declared inside parameter list
--- flock.o ---
In file included from ./include/bcollect.h:93:0,
                 from flock.c:31:
/tmp/pkgsrc/sysutils/bcollect/work/.buildlink/include/clib/clib.h:115:45: warning: 'struct sockaddr_storage' declared inside parameter list
/tmp/pkgsrc/sysutils/bcollect/work/.buildlink/include/clib/clib.h:115:45: warning: its scope is only this definition or declaration, which is probably not what you want
/tmp/pkgsrc/sysutils/bcollect/work/.buildlink/include/clib/clib.h:116:36: warning: 'struct sockaddr_storage' declared inside parameter list
mv -f .deps/flock.Tpo .deps/flock.Po
--- rmdir.o ---
In file included from ./include/bcollect.h:93:0,
                 from rmdir.c:31:
/tmp/pkgsrc/sysutils/bcollect/work/.buildlink/include/clib/clib.h:115:45: warning: 'struct sockaddr_storage' declared inside parameter list
/tmp/pkgsrc/sysutils/bcollect/work/.buildlink/include/clib/clib.h:115:45: warning: its scope is only this definition or declaration, which is probably not what you want
/tmp/pkgsrc/sysutils/bcollect/work/.buildlink/include/clib/clib.h:116:36: warning: 'struct sockaddr_storage' declared inside parameter list
--- main.o ---
mv -f .deps/main.Tpo .deps/main.Po
--- rmdir.o ---
mv -f .deps/rmdir.Tpo .deps/rmdir.Po
--- rmfr ---
gcc  -O3 -pipe -fstack-protector -I/usr/pkg/include  -L/usr/pkg/lib -Wl,-R/usr/pkg/lib -o rmfr rmdir.o rmfr.o  -lclib
--- backup.o ---
mv -f .deps/backup.Tpo .deps/backup.Po
--- bcollect ---
gcc  -O3 -pipe -fstack-protector -I/usr/pkg/include  -L/usr/pkg/lib -Wl,-R/usr/pkg/lib -o bcollect main.o rmdir.o backup.o  flock.o confparser/libconfparser.a -lclib
confparser/libconfparser.a(conflexer.o): In function `yylex':
conflexer.c:(.text+0xee6): undefined reference to `yywrap'
collect2: ld returned 1 exit status
*** [bcollect] Error code 1

bmake: stopped in /tmp/pkgsrc/sysutils/bcollect/work/bcollect-0.6.0
1 error

bmake: stopped in /tmp/pkgsrc/sysutils/bcollect/work/bcollect-0.6.0
*** [all-recursive] Error code 1

bmake: stopped in /tmp/pkgsrc/sysutils/bcollect/work/bcollect-0.6.0
1 error

bmake: stopped in /tmp/pkgsrc/sysutils/bcollect/work/bcollect-0.6.0
*** [all] Error code 2

bmake: stopped in /tmp/pkgsrc/sysutils/bcollect/work/bcollect-0.6.0
1 error

bmake: stopped in /tmp/pkgsrc/sysutils/bcollect/work/bcollect-0.6.0
*** Error code 2

Stop.
bmake: stopped in /usr/pkgsrc/sysutils/bcollect
*** Error code 1

Stop.
bmake: stopped in /usr/pkgsrc/sysutils/bcollect