=> Bootstrap dependency digest>=20010302: found digest-20111104
=> Bootstrap dependency fetch-[0-9]*: found fetch-1.7
===> Building for xentools33-3.3.2nb8
rm -f /tmp/pkgsrc/sysutils/xentools33/work/xen-3.3.2/tools/check/check_x11_devel
cp /usr/pkgsrc/sysutils/xentools33/files/blk_netbsd.c /tmp/pkgsrc/sysutils/xentools33/work/xen-3.3.2/tools/blktap/drivers/
cp /usr/pkgsrc/sysutils/xentools33/files/blktapctrl_netbsd.c /tmp/pkgsrc/sysutils/xentools33/work/xen-3.3.2/tools/blktap/drivers/
pod2man /tmp/pkgsrc/sysutils/xentools33/work/xen-3.3.2/tools/../docs/man/xend-config.sxp.pod.5  | sed -e "s,@XENDCONFDIR@,/usr/pkg/etc/xen,g"  >/tmp/pkgsrc/sysutils/xentools33/work/xend-config.sxp.5
pod2man /tmp/pkgsrc/sysutils/xentools33/work/xen-3.3.2/tools/../docs/man/xmdomain.cfg.pod.5 | sed -e "s,@XENDCONFDIR@,/usr/pkg/etc/xen,g"  >/tmp/pkgsrc/sysutils/xentools33/work/xmdomain.cfg.5
pod2man /tmp/pkgsrc/sysutils/xentools33/work/xen-3.3.2/tools/../docs/man/xm.pod.1 | sed -e "s,@XENDCONFDIR@,/usr/pkg/etc/xen,g"  >/tmp/pkgsrc/sysutils/xentools33/work/xm.1
make[1]: Entering directory `/tmp/pkgsrc/sysutils/xentools33/work/xen-3.3.2/tools'
/usr/bin/make -C check all
make[2]: Entering directory `/tmp/pkgsrc/sysutils/xentools33/work/xen-3.3.2/tools/check'
LIBXENAPI_BINDINGS=n ACM_SECURITY=n ./chk build
Xen CHECK-BUILD  Sun Nov 13 04:12:44 NZDT 2011
Checking check_crypto_lib: 
 *** check_crypto_lib FAILED: missing libcrypto.so
Checking check_curl: unused, OK
Checking check_openssl_devel: 
 *** check_openssl_devel FAILED: missing openssl headers
Checking check_python: OK
Checking check_python_devel: OK
Checking check_xgettext: OK
Checking check_xml2: unused, OK
Checking check_zlib_devel: OK
Checking check_zlib_lib: OK
make[2]: *** [check-build] Error 1
make[2]: Leaving directory `/tmp/pkgsrc/sysutils/xentools33/work/xen-3.3.2/tools/check'
make[1]: *** [subdir-all-check] Error 2
make[1]: Leaving directory `/tmp/pkgsrc/sysutils/xentools33/work/xen-3.3.2/tools'
make: *** [subdirs-all] Error 2
*** Error code 2

Stop.
bmake: stopped in /usr/pkgsrc/sysutils/xentools33
*** Error code 1

Stop.
bmake: stopped in /usr/pkgsrc/sysutils/xentools33