=> Bootstrap dependency digest>=20010302: found digest-20111104
WARNING: [license.mk] Every package should define a LICENSE.
===> Building for nvu-1.0nb6
/Users/kristerw/pbulk/scratch/www/nvu/work/.tools/bin/make export
rm -f -rf ./dist/sdk
/Users/kristerw/pbulk/scratch/www/nvu/work/.tools/bin/make -C config export
Creating .deps
nsinstall.c
gcc -o host_nsinstall.o -c -pipe -O2 -I/usr/pkg/include -I/usr/pkg/include/gettext -I/usr/include -I/usr/X11/include -DXP_UNIX -DXP_MACOSX -DNO_X11   -I../dist/include -I../dist/include -I/Users/kristerw/pbulk/scratch/www/nvu/work/mozilla/dist/include/nspr     -I/Users/kristerw/pbulk/scratch/www/nvu/work/mozilla/dist/include/nspr  nsinstall.c
pathsub.c
gcc -o host_pathsub.o -c -pipe -O2 -I/usr/pkg/include -I/usr/pkg/include/gettext -I/usr/include -I/usr/X11/include -DXP_UNIX -DXP_MACOSX -DNO_X11   -I../dist/include -I../dist/include -I/Users/kristerw/pbulk/scratch/www/nvu/work/mozilla/dist/include/nspr     -I/Users/kristerw/pbulk/scratch/www/nvu/work/mozilla/dist/include/nspr  pathsub.c
gcc -o nsinstall -pipe -O2 -I/usr/pkg/include -I/usr/pkg/include/gettext -I/usr/include -I/usr/X11/include -DXP_UNIX -DXP_MACOSX -DNO_X11  host_nsinstall.o host_pathsub.o  
rm -f nfspwd
cp nfspwd.pl nfspwd
chmod +x nfspwd
rm -f revdepth
cp revdepth.pl revdepth
chmod +x revdepth
asdecode.cpp
g++ -o asdecode.o -c -DOSTYPE=\"Darwin12.2.0\" -DOSARCH=\"Darwin\"   -I../dist/include -I../dist/include -I/Users/kristerw/pbulk/scratch/www/nvu/work/mozilla/dist/include/nspr     -I/usr/X11/include   -fPIC  -I/usr/pkg/include/libIDL-2.0 -no-cpp-precomp -isystem /usr/include -I/usr/pkg/include -I/usr/pkg/include/gettext -I/usr/include -I/usr/X11/include  -I/usr/X11/include -fno-rtti -fno-exceptions -Wall -Wconversion -Wpointer-arith -Wcast-align -Woverloaded-virtual -Wsynth -Wno-ctor-dtor-privacy -Wno-non-virtual-dtor -Wno-long-long -pipe -O2 -I/usr/pkg/include -I/usr/pkg/include/gettext -I/usr/include -I/usr/X11/include -fpascal-strings -no-cpp-precomp -fno-common -fshort-wchar -pthread -pipe  -DDEBUG -D_DEBUG -DDEBUG_kristerw -DTRACING -g  -I/usr/pkg/include/libIDL-2.0 -no-cpp-precomp -isystem /usr/include -I/usr/pkg/include -I/usr/pkg/include/gettext -I/usr/include -I/usr/X11/include  -I/usr/X11/include -DMOZILLA_CLIENT -include ../mozilla-config.h -Wp,-MD,.deps/asdecode.pp asdecode.cpp
asdecode.cpp: In function 'int main(int, char**)':
asdecode.cpp:114: warning: comparison between signed and unsigned integer expressions
asdecode.cpp: At global scope:
asdecode.cpp:57: warning: 'int read_int(FILE*)' defined but not used
g++  -I/usr/pkg/include/libIDL-2.0 -no-cpp-precomp -isystem /usr/include -I/usr/pkg/include -I/usr/pkg/include/gettext -I/usr/include -I/usr/X11/include  -I/usr/X11/include -fno-rtti -fno-exceptions -Wall -Wconversion -Wpointer-arith -Wcast-align -Woverloaded-virtual -Wsynth -Wno-ctor-dtor-privacy -Wno-non-virtual-dtor -Wno-long-long -pipe -O2 -I/usr/pkg/include -I/usr/pkg/include/gettext -I/usr/include -I/usr/X11/include -fpascal-strings -no-cpp-precomp -fno-common -fshort-wchar -pthread -pipe  -DDEBUG -D_DEBUG -DDEBUG_kristerw -DTRACING -g -o asdecode asdecode.o  -L/usr/pkg/lib -L/usr/lib -L/usr/X11/lib         -L../dist/bin -L../dist/lib  -lm     
ld: warning: directory not found for option '-L../dist/bin'
ld: warning: directory not found for option '-L../dist/lib'
/usr/pkg/bin/perl -I. ./bdate.pl build_number 
rm -f nsBuildID.h
/usr/pkg/bin/perl -I. ./aboutime.pl -m ./milestone.txt nsBuildID.h build_number ./nsBuildID.h.in
/Users/kristerw/pbulk/scratch/www/nvu/work/mozilla/config/nsinstall -L /Users/kristerw/pbulk/scratch/www/nvu/work/mozilla/config -m 644 nsBuildID.h ../mozilla-config.h ../dist/include
/usr/pkg/bin/perl -I../config ../config/build-list.pl ../dist/include/.headerlist nsBuildID.h ../mozilla-config.h
rm -f ../config/final-link-comps ../config/final-link-libs ../config/final-link-comp-names
rm -f ../dist/bin/chrome/chromelist.txt
/Users/kristerw/pbulk/scratch/www/nvu/work/mozilla/config/nsinstall -t -m 644 nsBuildID.h ../mozilla-config.h ../dist/sdk/include
/Users/kristerw/pbulk/scratch/www/nvu/work/mozilla/config/nsinstall -L /Users/kristerw/pbulk/scratch/www/nvu/work/mozilla/config nsinstall ../dist/bin
/Users/kristerw/pbulk/scratch/www/nvu/work/.tools/bin/make nspr
/Users/kristerw/pbulk/scratch/www/nvu/work/.tools/bin/make -C nsprpub
cd config; /Users/kristerw/pbulk/scratch/www/nvu/work/.tools/bin/make -j1 export
gcc -o now.o -c   -I/usr/pkg/include/libIDL-2.0 -no-cpp-precomp -isystem /usr/include -I/usr/pkg/include -I/usr/pkg/include/gettext -I/usr/include -I/usr/X11/include -pipe -O2 -I/usr/pkg/include -I/usr/pkg/include/gettext -I/usr/include -I/usr/X11/include -pipe -Wmost -fno-common -no-cpp-precomp -pthread -g   -UNDEBUG -DDEBUG_kristerw -DMOZILLA_CLIENT=1 -DDEBUG=1 -DXP_UNIX=1 -DDARWIN=1 -DHAVE_BSD_FLOCK=1 -Di386=1 -DXP_MACOSX=1 -DMACOS_DEPLOYMENT_TARGET=100100 -DHAVE_LCHOWN=1 -DHAVE_STRERROR=1  -DFORCE_PR_LOG -D_PR_PTHREADS -UHAVE_CVAR_BUILT_ON_SEM   now.c
gcc  now.o -L/usr/pkg/lib -L/usr/lib -L/usr/X11/lib  -o now
gcc -o nsinstall.o -c   -I/usr/pkg/include/libIDL-2.0 -no-cpp-precomp -isystem /usr/include -I/usr/pkg/include -I/usr/pkg/include/gettext -I/usr/include -I/usr/X11/include -pipe -O2 -I/usr/pkg/include -I/usr/pkg/include/gettext -I/usr/include -I/usr/X11/include -pipe -Wmost -fno-common -no-cpp-precomp -pthread -g   -UNDEBUG -DDEBUG_kristerw -DMOZILLA_CLIENT=1 -DDEBUG=1 -DXP_UNIX=1 -DDARWIN=1 -DHAVE_BSD_FLOCK=1 -Di386=1 -DXP_MACOSX=1 -DMACOS_DEPLOYMENT_TARGET=100100 -DHAVE_LCHOWN=1 -DHAVE_STRERROR=1  -DFORCE_PR_LOG -D_PR_PTHREADS -UHAVE_CVAR_BUILT_ON_SEM   nsinstall.c
gcc  nsinstall.o -L/usr/pkg/lib -L/usr/lib -L/usr/X11/lib  -o nsinstall
rm -f nfspwd; cp nfspwd.pl nfspwd; chmod +x nfspwd
rm -f /Users/kristerw/pbulk/scratch/www/nvu/work/mozilla/dist/bin/nspr-config
cd pr; /Users/kristerw/pbulk/scratch/www/nvu/work/.tools/bin/make -j1 export
cd include; /Users/kristerw/pbulk/scratch/www/nvu/work/.tools/bin/make export
cd md; /Users/kristerw/pbulk/scratch/www/nvu/work/.tools/bin/make export
../../../config/./nsinstall -L /Users/kristerw/pbulk/scratch/www/nvu/work/mozilla/nsprpub/pr/include/md -m 444 ./_aix32.cfg ./_aix64.cfg ./_beos.cfg ./_bsdi.cfg ./_darwin.cfg ./_dgux.cfg ./_freebsd.cfg ./_hpux32.cfg ./_hpux64.cfg ./_irix32.cfg ./_irix64.cfg ./_linux.cfg ./_ncr.cfg ./_nec.cfg ./_netbsd.cfg ./_nextstep.cfg ./_nto.cfg ./_openbsd.cfg ./_openvms.cfg ./_os2.cfg ./_osf1.cfg ./_qnx.cfg ./_reliantunix.cfg ./_rhapsody.cfg ./_scoos.cfg ./_solaris32.cfg ./_solaris64.cfg ./_sony.cfg ./_sunos4.cfg ./_unixware.cfg ./_unixware7.cfg ./_win16.cfg ./_win95.cfg ./_winnt.cfg ./_aix.h ./_beos.h ./_bsdi.h ./_darwin.h ./_dgux.h ./_freebsd.h ./_hpux.h ./_irix.h ./_linux.h ./_macos.h ./_ncr.h ./_nec.h ./_netbsd.h ./_nextstep.h ./_nspr_pthread.h ./_nto.h ./_openbsd.h ./_openvms.h ./_os2.h ./_os2_errors.h ./_osf1.h ./_pcos.h ./_pth.h ./_qnx.h ./_reliantunix.h ./_rhapsody.h ./_scoos.h ./_solaris.h ./_sony.h ./_sunos4.h ./_unix_errors.h ./_unixos.h ./_unixware.h ./_win16.h ./_win32_errors.h ./_win95.h ./_winnt.h ./prosdep.h ./sunos4.h /Users/kristerw/pbulk/scratch/www/nvu/work/mozilla/dist/include/nspr/md
../../../config/./nsinstall -L /Users/kristerw/pbulk/scratch/www/nvu/work/mozilla/nsprpub/pr/include/md -m 444 ./_darwin.cfg /Users/kristerw/pbulk/scratch/www/nvu/work/mozilla/dist/include/nspr
mv -f /Users/kristerw/pbulk/scratch/www/nvu/work/mozilla/dist/include/nspr/_darwin.cfg /Users/kristerw/pbulk/scratch/www/nvu/work/mozilla/dist/include/nspr/prcpucfg.h
cd private; /Users/kristerw/pbulk/scratch/www/nvu/work/.tools/bin/make export
../../../config/./nsinstall -L /Users/kristerw/pbulk/scratch/www/nvu/work/mozilla/nsprpub/pr/include/private -m 444 ./pprio.h ./pprthred.h ./prpriv.h /Users/kristerw/pbulk/scratch/www/nvu/work/mozilla/dist/include/nspr/private
cd obsolete; /Users/kristerw/pbulk/scratch/www/nvu/work/.tools/bin/make export
../../../config/./nsinstall -L /Users/kristerw/pbulk/scratch/www/nvu/work/mozilla/nsprpub/pr/include/obsolete -m 444 ./pralarm.h ./probslet.h ./protypes.h ./prsem.h /Users/kristerw/pbulk/scratch/www/nvu/work/mozilla/dist/include/nspr/obsolete
../../config/./nsinstall -L /Users/kristerw/pbulk/scratch/www/nvu/work/mozilla/nsprpub/pr/include -m 444 ./nspr.h ./pratom.h ./prbit.h ./prclist.h ./prcmon.h ./prcountr.h ./prcvar.h ./prdtoa.h ./prenv.h ./prerr.h ./prerror.h ./prinet.h ./prinit.h ./prinrval.h ./prio.h ./pripcsem.h ./prlink.h ./prlock.h ./prlog.h ./prlong.h ./prmem.h ./prmon.h ./prmwait.h ./prnetdb.h ./prolock.h ./prpdce.h ./prprf.h ./prproces.h ./prrng.h ./prrwlock.h ./prshm.h ./prshma.h ./prsystem.h ./prthread.h ./prtime.h ./prtpool.h ./prtrace.h ./prtypes.h ./prvrsion.h ./prwin16.h /Users/kristerw/pbulk/scratch/www/nvu/work/mozilla/dist/include/nspr
cd src; /Users/kristerw/pbulk/scratch/www/nvu/work/.tools/bin/make export
cd io; /Users/kristerw/pbulk/scratch/www/nvu/work/.tools/bin/make export
gcc -o prfdcach.o -c   -I/usr/pkg/include/libIDL-2.0 -no-cpp-precomp -isystem /usr/include -I/usr/pkg/include -I/usr/pkg/include/gettext -I/usr/include -I/usr/X11/include -pipe -O2 -I/usr/pkg/include -I/usr/pkg/include/gettext -I/usr/include -I/usr/X11/include -pipe -Wmost -fno-common -no-cpp-precomp -pthread -g   -UNDEBUG -DDEBUG_kristerw -DMOZILLA_CLIENT=1 -DDEBUG=1 -DXP_UNIX=1 -DDARWIN=1 -DHAVE_BSD_FLOCK=1 -Di386=1 -DXP_MACOSX=1 -DMACOS_DEPLOYMENT_TARGET=100100 -DHAVE_LCHOWN=1 -DHAVE_STRERROR=1  -DFORCE_PR_LOG -D_PR_PTHREADS -UHAVE_CVAR_BUILT_ON_SEM -D_NSPR_BUILD_ -I/Users/kristerw/pbulk/scratch/www/nvu/work/mozilla/dist/include/nspr -I../../../pr/include -I../../../pr/include/private  prfdcach.c
gcc -o prmwait.o -c   -I/usr/pkg/include/libIDL-2.0 -no-cpp-precomp -isystem /usr/include -I/usr/pkg/include -I/usr/pkg/include/gettext -I/usr/include -I/usr/X11/include -pipe -O2 -I/usr/pkg/include -I/usr/pkg/include/gettext -I/usr/include -I/usr/X11/include -pipe -Wmost -fno-common -no-cpp-precomp -pthread -g   -UNDEBUG -DDEBUG_kristerw -DMOZILLA_CLIENT=1 -DDEBUG=1 -DXP_UNIX=1 -DDARWIN=1 -DHAVE_BSD_FLOCK=1 -Di386=1 -DXP_MACOSX=1 -DMACOS_DEPLOYMENT_TARGET=100100 -DHAVE_LCHOWN=1 -DHAVE_STRERROR=1  -DFORCE_PR_LOG -D_PR_PTHREADS -UHAVE_CVAR_BUILT_ON_SEM -D_NSPR_BUILD_ -I/Users/kristerw/pbulk/scratch/www/nvu/work/mozilla/dist/include/nspr -I../../../pr/include -I../../../pr/include/private  prmwait.c
gcc -o priometh.o -c   -I/usr/pkg/include/libIDL-2.0 -no-cpp-precomp -isystem /usr/include -I/usr/pkg/include -I/usr/pkg/include/gettext -I/usr/include -I/usr/X11/include -pipe -O2 -I/usr/pkg/include -I/usr/pkg/include/gettext -I/usr/include -I/usr/X11/include -pipe -Wmost -fno-common -no-cpp-precomp -pthread -g   -UNDEBUG -DDEBUG_kristerw -DMOZILLA_CLIENT=1 -DDEBUG=1 -DXP_UNIX=1 -DDARWIN=1 -DHAVE_BSD_FLOCK=1 -Di386=1 -DXP_MACOSX=1 -DMACOS_DEPLOYMENT_TARGET=100100 -DHAVE_LCHOWN=1 -DHAVE_STRERROR=1  -DFORCE_PR_LOG -D_PR_PTHREADS -UHAVE_CVAR_BUILT_ON_SEM -D_NSPR_BUILD_ -I/Users/kristerw/pbulk/scratch/www/nvu/work/mozilla/dist/include/nspr -I../../../pr/include -I../../../pr/include/private  priometh.c
gcc -o pripv6.o -c   -I/usr/pkg/include/libIDL-2.0 -no-cpp-precomp -isystem /usr/include -I/usr/pkg/include -I/usr/pkg/include/gettext -I/usr/include -I/usr/X11/include -pipe -O2 -I/usr/pkg/include -I/usr/pkg/include/gettext -I/usr/include -I/usr/X11/include -pipe -Wmost -fno-common -no-cpp-precomp -pthread -g   -UNDEBUG -DDEBUG_kristerw -DMOZILLA_CLIENT=1 -DDEBUG=1 -DXP_UNIX=1 -DDARWIN=1 -DHAVE_BSD_FLOCK=1 -Di386=1 -DXP_MACOSX=1 -DMACOS_DEPLOYMENT_TARGET=100100 -DHAVE_LCHOWN=1 -DHAVE_STRERROR=1  -DFORCE_PR_LOG -D_PR_PTHREADS -UHAVE_CVAR_BUILT_ON_SEM -D_NSPR_BUILD_ -I/Users/kristerw/pbulk/scratch/www/nvu/work/mozilla/dist/include/nspr -I../../../pr/include -I../../../pr/include/private  pripv6.c
gcc -o prmapopt.o -c   -I/usr/pkg/include/libIDL-2.0 -no-cpp-precomp -isystem /usr/include -I/usr/pkg/include -I/usr/pkg/include/gettext -I/usr/include -I/usr/X11/include -pipe -O2 -I/usr/pkg/include -I/usr/pkg/include/gettext -I/usr/include -I/usr/X11/include -pipe -Wmost -fno-common -no-cpp-precomp -pthread -g   -UNDEBUG -DDEBUG_kristerw -DMOZILLA_CLIENT=1 -DDEBUG=1 -DXP_UNIX=1 -DDARWIN=1 -DHAVE_BSD_FLOCK=1 -Di386=1 -DXP_MACOSX=1 -DMACOS_DEPLOYMENT_TARGET=100100 -DHAVE_LCHOWN=1 -DHAVE_STRERROR=1  -DFORCE_PR_LOG -D_PR_PTHREADS -UHAVE_CVAR_BUILT_ON_SEM -D_NSPR_BUILD_ -I/Users/kristerw/pbulk/scratch/www/nvu/work/mozilla/dist/include/nspr -I../../../pr/include -I../../../pr/include/private  prmapopt.c
gcc -o prlayer.o -c   -I/usr/pkg/include/libIDL-2.0 -no-cpp-precomp -isystem /usr/include -I/usr/pkg/include -I/usr/pkg/include/gettext -I/usr/include -I/usr/X11/include -pipe -O2 -I/usr/pkg/include -I/usr/pkg/include/gettext -I/usr/include -I/usr/X11/include -pipe -Wmost -fno-common -no-cpp-precomp -pthread -g   -UNDEBUG -DDEBUG_kristerw -DMOZILLA_CLIENT=1 -DDEBUG=1 -DXP_UNIX=1 -DDARWIN=1 -DHAVE_BSD_FLOCK=1 -Di386=1 -DXP_MACOSX=1 -DMACOS_DEPLOYMENT_TARGET=100100 -DHAVE_LCHOWN=1 -DHAVE_STRERROR=1  -DFORCE_PR_LOG -D_PR_PTHREADS -UHAVE_CVAR_BUILT_ON_SEM -D_NSPR_BUILD_ -I/Users/kristerw/pbulk/scratch/www/nvu/work/mozilla/dist/include/nspr -I../../../pr/include -I../../../pr/include/private  prlayer.c
gcc -o prlog.o -c   -I/usr/pkg/include/libIDL-2.0 -no-cpp-precomp -isystem /usr/include -I/usr/pkg/include -I/usr/pkg/include/gettext -I/usr/include -I/usr/X11/include -pipe -O2 -I/usr/pkg/include -I/usr/pkg/include/gettext -I/usr/include -I/usr/X11/include -pipe -Wmost -fno-common -no-cpp-precomp -pthread -g   -UNDEBUG -DDEBUG_kristerw -DMOZILLA_CLIENT=1 -DDEBUG=1 -DXP_UNIX=1 -DDARWIN=1 -DHAVE_BSD_FLOCK=1 -Di386=1 -DXP_MACOSX=1 -DMACOS_DEPLOYMENT_TARGET=100100 -DHAVE_LCHOWN=1 -DHAVE_STRERROR=1  -DFORCE_PR_LOG -D_PR_PTHREADS -UHAVE_CVAR_BUILT_ON_SEM -D_NSPR_BUILD_ -I/Users/kristerw/pbulk/scratch/www/nvu/work/mozilla/dist/include/nspr -I../../../pr/include -I../../../pr/include/private  prlog.c
gcc -o prmmap.o -c   -I/usr/pkg/include/libIDL-2.0 -no-cpp-precomp -isystem /usr/include -I/usr/pkg/include -I/usr/pkg/include/gettext -I/usr/include -I/usr/X11/include -pipe -O2 -I/usr/pkg/include -I/usr/pkg/include/gettext -I/usr/include -I/usr/X11/include -pipe -Wmost -fno-common -no-cpp-precomp -pthread -g   -UNDEBUG -DDEBUG_kristerw -DMOZILLA_CLIENT=1 -DDEBUG=1 -DXP_UNIX=1 -DDARWIN=1 -DHAVE_BSD_FLOCK=1 -Di386=1 -DXP_MACOSX=1 -DMACOS_DEPLOYMENT_TARGET=100100 -DHAVE_LCHOWN=1 -DHAVE_STRERROR=1  -DFORCE_PR_LOG -D_PR_PTHREADS -UHAVE_CVAR_BUILT_ON_SEM -D_NSPR_BUILD_ -I/Users/kristerw/pbulk/scratch/www/nvu/work/mozilla/dist/include/nspr -I../../../pr/include -I../../../pr/include/private  prmmap.c
gcc -o prpolevt.o -c   -I/usr/pkg/include/libIDL-2.0 -no-cpp-precomp -isystem /usr/include -I/usr/pkg/include -I/usr/pkg/include/gettext -I/usr/include -I/usr/X11/include -pipe -O2 -I/usr/pkg/include -I/usr/pkg/include/gettext -I/usr/include -I/usr/X11/include -pipe -Wmost -fno-common -no-cpp-precomp -pthread -g   -UNDEBUG -DDEBUG_kristerw -DMOZILLA_CLIENT=1 -DDEBUG=1 -DXP_UNIX=1 -DDARWIN=1 -DHAVE_BSD_FLOCK=1 -Di386=1 -DXP_MACOSX=1 -DMACOS_DEPLOYMENT_TARGET=100100 -DHAVE_LCHOWN=1 -DHAVE_STRERROR=1  -DFORCE_PR_LOG -D_PR_PTHREADS -UHAVE_CVAR_BUILT_ON_SEM -D_NSPR_BUILD_ -I/Users/kristerw/pbulk/scratch/www/nvu/work/mozilla/dist/include/nspr -I../../../pr/include -I../../../pr/include/private  prpolevt.c
gcc -o prprf.o -c   -I/usr/pkg/include/libIDL-2.0 -no-cpp-precomp -isystem /usr/include -I/usr/pkg/include -I/usr/pkg/include/gettext -I/usr/include -I/usr/X11/include -pipe -O2 -I/usr/pkg/include -I/usr/pkg/include/gettext -I/usr/include -I/usr/X11/include -pipe -Wmost -fno-common -no-cpp-precomp -pthread -g   -UNDEBUG -DDEBUG_kristerw -DMOZILLA_CLIENT=1 -DDEBUG=1 -DXP_UNIX=1 -DDARWIN=1 -DHAVE_BSD_FLOCK=1 -Di386=1 -DXP_MACOSX=1 -DMACOS_DEPLOYMENT_TARGET=100100 -DHAVE_LCHOWN=1 -DHAVE_STRERROR=1  -DFORCE_PR_LOG -D_PR_PTHREADS -UHAVE_CVAR_BUILT_ON_SEM -D_NSPR_BUILD_ -I/Users/kristerw/pbulk/scratch/www/nvu/work/mozilla/dist/include/nspr -I../../../pr/include -I../../../pr/include/private  prprf.c
gcc -o prscanf.o -c   -I/usr/pkg/include/libIDL-2.0 -no-cpp-precomp -isystem /usr/include -I/usr/pkg/include -I/usr/pkg/include/gettext -I/usr/include -I/usr/X11/include -pipe -O2 -I/usr/pkg/include -I/usr/pkg/include/gettext -I/usr/include -I/usr/X11/include -pipe -Wmost -fno-common -no-cpp-precomp -pthread -g   -UNDEBUG -DDEBUG_kristerw -DMOZILLA_CLIENT=1 -DDEBUG=1 -DXP_UNIX=1 -DDARWIN=1 -DHAVE_BSD_FLOCK=1 -Di386=1 -DXP_MACOSX=1 -DMACOS_DEPLOYMENT_TARGET=100100 -DHAVE_LCHOWN=1 -DHAVE_STRERROR=1  -DFORCE_PR_LOG -D_PR_PTHREADS -UHAVE_CVAR_BUILT_ON_SEM -D_NSPR_BUILD_ -I/Users/kristerw/pbulk/scratch/www/nvu/work/mozilla/dist/include/nspr -I../../../pr/include -I../../../pr/include/private  prscanf.c
gcc -o prstdio.o -c   -I/usr/pkg/include/libIDL-2.0 -no-cpp-precomp -isystem /usr/include -I/usr/pkg/include -I/usr/pkg/include/gettext -I/usr/include -I/usr/X11/include -pipe -O2 -I/usr/pkg/include -I/usr/pkg/include/gettext -I/usr/include -I/usr/X11/include -pipe -Wmost -fno-common -no-cpp-precomp -pthread -g   -UNDEBUG -DDEBUG_kristerw -DMOZILLA_CLIENT=1 -DDEBUG=1 -DXP_UNIX=1 -DDARWIN=1 -DHAVE_BSD_FLOCK=1 -Di386=1 -DXP_MACOSX=1 -DMACOS_DEPLOYMENT_TARGET=100100 -DHAVE_LCHOWN=1 -DHAVE_STRERROR=1  -DFORCE_PR_LOG -D_PR_PTHREADS -UHAVE_CVAR_BUILT_ON_SEM -D_NSPR_BUILD_ -I/Users/kristerw/pbulk/scratch/www/nvu/work/mozilla/dist/include/nspr -I../../../pr/include -I../../../pr/include/private  prstdio.c
cd linking; /Users/kristerw/pbulk/scratch/www/nvu/work/.tools/bin/make export
gcc -o prlink.o -c   -I/usr/pkg/include/libIDL-2.0 -no-cpp-precomp -isystem /usr/include -I/usr/pkg/include -I/usr/pkg/include/gettext -I/usr/include -I/usr/X11/include -pipe -O2 -I/usr/pkg/include -I/usr/pkg/include/gettext -I/usr/include -I/usr/X11/include -pipe -Wmost -fno-common -no-cpp-precomp -pthread -g   -UNDEBUG -DDEBUG_kristerw -DMOZILLA_CLIENT=1 -DDEBUG=1 -DXP_UNIX=1 -DDARWIN=1 -DHAVE_BSD_FLOCK=1 -Di386=1 -DXP_MACOSX=1 -DMACOS_DEPLOYMENT_TARGET=100100 -DHAVE_LCHOWN=1 -DHAVE_STRERROR=1  -DFORCE_PR_LOG -D_PR_PTHREADS -UHAVE_CVAR_BUILT_ON_SEM -D_NSPR_BUILD_ -I/Users/kristerw/pbulk/scratch/www/nvu/work/mozilla/dist/include/nspr -I../../../pr/include -I../../../pr/include/private -I/Developer/Headers/FlatCarbon  prlink.c
prlink.c:44:27: error: CodeFragments.h: No such file or directory
prlink.c:45:23: error: TextUtils.h: No such file or directory
prlink.c:46:19: error: Types.h: No such file or directory
prlink.c:47:21: error: Aliases.h: No such file or directory
prlink.c:191: error: expected specifier-qualifier-list before 'CFragConnectionID'
prlink.c: In function '_PR_InitLinker':
prlink.c:330: error: 'PRLibrary' has no member named 'dlh'
prlink.c: In function 'pr_LoadMachDyldModule':
prlink.c:645: warning: 'NSCreateObjectFileImageFromFile' is deprecated (declared at /usr/include/mach-o/dyld.h:144)
prlink.c:647: warning: 'NSLinkModule' is deprecated (declared at /usr/include/mach-o/dyld.h:160)
prlink.c:653: warning: 'NSDestroyObjectFileImage' is deprecated (declared at /usr/include/mach-o/dyld.h:146)
prlink.c:655: warning: 'NSUnLinkModule' is deprecated (declared at /usr/include/mach-o/dyld.h:168)
prlink.c: At top level:
prlink.c:667: error: expected ')' before 'dict'
prlink.c: In function 'pr_LoadViaCFM':
prlink.c:715: error: 'OSErr' undeclared (first use in this function)
prlink.c:715: error: (Each undeclared identifier is reported only once
prlink.c:715: error: for each function it appears in.)
prlink.c:715: error: expected ';' before 'err'
prlink.c:717: error: 'Str255' undeclared (first use in this function)
prlink.c:717: error: expected ';' before 'errName'
prlink.c:775: error: 'FSSpec' undeclared (first use in this function)
prlink.c:775: error: expected ';' before 'fileSpec'
prlink.c:776: error: 'Boolean' undeclared (first use in this function)
prlink.c:776: error: expected ';' before 'tempUnusedBool'
prlink.c:781: error: 'FSRef' undeclared (first use in this function)
prlink.c:781: error: expected ';' before 'ref'
prlink.c:782: error: 'err' undeclared (first use in this function)
prlink.c:782: warning: implicit declaration of function 'FSPathMakeRef'
prlink.c:782: error: expected ')' before 'UInt8'
prlink.c:782: warning: type defaults to 'int' in declaration of 'type name'
prlink.c:782: error: 'ref' undeclared (first use in this function)
prlink.c:783: error: 'noErr' undeclared (first use in this function)
prlink.c:784: warning: implicit declaration of function 'FSGetCatalogInfo'
prlink.c:784: error: 'kFSCatInfoNone' undeclared (first use in this function)
prlink.c:785: error: 'fileSpec' undeclared (first use in this function)
prlink.c:795: warning: implicit declaration of function 'ResolveAliasFile'
prlink.c:795: error: 'tempUnusedBool' undeclared (first use in this function)
prlink.c:801: warning: implicit declaration of function 'GetDiskFragment'
prlink.c:801: error: 'kCFragGoesToEOF' undeclared (first use in this function)
prlink.c:802: error: 'kLoadCFrag' undeclared (first use in this function)
prlink.c:802: error: 'PRLibrary' has no member named 'connection'
prlink.c:802: error: 'PRLibrary' has no member named 'main'
prlink.c:802: error: 'errName' undeclared (first use in this function)
prlink.c:812: error: 'PRLibrary' has no member named 'connection'
prlink.c:818: error: 'PRLibrary' has no member named 'wrappers'
prlink.c:818: warning: implicit declaration of function 'CFDictionaryCreateMutable'
prlink.c:819: error: 'kCFTypeDictionaryKeyCallBacks' undeclared (first use in this function)
prlink.c:820: error: 'kCFTypeDictionaryValueCallBacks' undeclared (first use in this function)
prlink.c:821: error: 'PRLibrary' has no member named 'wrappers'
prlink.c:822: error: 'PRLibrary' has no member named 'main'
prlink.c:822: warning: implicit declaration of function 'TV2FP'
prlink.c:822: error: 'PRLibrary' has no member named 'wrappers'
prlink.c:822: error: 'PRLibrary' has no member named 'main'
prlink.c:824: error: 'memFullErr' undeclared (first use in this function)
prlink.c: In function 'pr_LoadViaDyld':
prlink.c:895: error: 'PRLibrary' has no member named 'dlh'
prlink.c:896: error: 'PRLibrary' has no member named 'dlh'
prlink.c:897: error: 'PRLibrary' has no member named 'image'
prlink.c:897: warning: 'NSAddImage' is deprecated (declared at /usr/include/mach-o/dyld.h:229)
prlink.c:904: error: 'PRLibrary' has no member named 'dlh'
prlink.c:904: error: 'PRLibrary' has no member named 'image'
prlink.c: In function 'pr_LoadLibraryByPathname':
prlink.c:989: error: 'pr_LoadCFBundle' undeclared (first use in this function)
prlink.c:1002: error: 'cfragNoLibraryErr' undeclared (first use in this function)
prlink.c:1002: warning: assignment makes integer from pointer without a cast
prlink.c: In function 'PR_UnloadLibrary':
prlink.c:1360: warning: 'NSUnLinkModule' is deprecated (declared at /usr/include/mach-o/dyld.h:168)
prlink.c:1360: error: 'PRLibrary' has no member named 'dlh'
prlink.c:1360: warning: passing argument 1 of 'NSUnLinkModule' from incompatible pointer type
prlink.c:1375: error: 'PRLibrary' has no member named 'connection'
prlink.c:1376: warning: implicit declaration of function 'CloseConnection'
prlink.c:1376: error: 'PRLibrary' has no member named 'connection'
prlink.c:1382: error: 'PRLibrary' has no member named 'wrappers'
prlink.c:1383: warning: implicit declaration of function 'CFRelease'
prlink.c:1383: error: 'PRLibrary' has no member named 'wrappers'
prlink.c: In function 'pr_FindSymbolInLib':
prlink.c:1491: error: 'PRLibrary' has no member named 'connection'
prlink.c:1492: error: 'Ptr' undeclared (first use in this function)
prlink.c:1492: warning: statement with no effect
prlink.c:1492: error: expected ';' before 'symAddr'
prlink.c:1493: error: 'CFragSymbolClass' undeclared (first use in this function)
prlink.c:1493: warning: statement with no effect
prlink.c:1493: error: expected ';' before 'symClass'
prlink.c:1494: error: 'Str255' undeclared (first use in this function)
prlink.c:1494: warning: statement with no effect
prlink.c:1494: error: expected ';' before 'pName'
prlink.c:1498: warning: implicit declaration of function 'c2pstrcpy'
prlink.c:1498: error: 'pName' undeclared (first use in this function)
prlink.c:1501: warning: implicit declaration of function 'FindSymbol'
prlink.c:1501: error: 'PRLibrary' has no member named 'connection'
prlink.c:1501: error: 'symAddr' undeclared (first use in this function)
prlink.c:1501: error: 'symClass' undeclared (first use in this function)
prlink.c:1501: error: 'noErr' undeclared (first use in this function)
prlink.c:1501: warning: comparison between pointer and integer
prlink.c:1501: warning: assignment discards qualifiers from pointer target type
prlink.c:1508: error: 'kTVectorCFragSymbol' undeclared (first use in this function)
prlink.c:1509: error: 'PRLibrary' has no member named 'wrappers'
prlink.c:1509: warning: assignment makes pointer from integer without a cast
prlink.c:1513: error: 'PRLibrary' has no member named 'main'
prlink.c:1513: warning: assignment discards qualifiers from pointer target type
prlink.c:1516: error: 'PRLibrary' has no member named 'image'
prlink.c:1518: warning: 'NSLookupSymbolInImage' is deprecated (declared at /usr/include/mach-o/dyld.h:181)
prlink.c:1518: error: 'PRLibrary' has no member named 'image'
prlink.c:1520: warning: passing argument 1 of 'NSLookupSymbolInImage' from incompatible pointer type
prlink.c:1522: warning: 'NSAddressOfSymbol' is deprecated (declared at /usr/include/mach-o/dyld.h:187)
prlink.c:1545: error: 'PRLibrary' has no member named 'dlh'
prlink.c:1547: warning: 'NSLookupSymbolInModule' is deprecated (declared at /usr/include/mach-o/dyld.h:180)
prlink.c:1547: error: 'PRLibrary' has no member named 'dlh'
prlink.c:1547: warning: passing argument 1 of 'NSLookupSymbolInModule' from incompatible pointer type
prlink.c:1549: warning: 'NSAddressOfSymbol' is deprecated (declared at /usr/include/mach-o/dyld.h:187)
prlink.c: In function 'PR_LoadStaticLibrary':
prlink.c:1702: error: 'PRLibrary' has no member named 'dlh'
prlink.c:1702: error: 'PRLibrary' has no member named 'dlh'
prlink.c:1702: warning: statement with no effect
prlink.c: In function 'PR_GetLibraryFilePathname':
prlink.c:1739: warning: assignment discards qualifiers from pointer target type
make[6]: *** [prlink.o] Error 1
make[5]: *** [export] Error 2
make[4]: *** [export] Error 2
make[3]: *** [export] Error 2
make[2]: *** [nspr] Error 2
make[1]: *** [export] Error 2
gnumake: *** [all] Error 2
*** Error code 2

Stop.
bmake: stopped in /Users/kristerw/pbulk/pkgsrc/www/nvu
*** Error code 1

Stop.
bmake: stopped in /Users/kristerw/pbulk/pkgsrc/www/nvu