=> Bootstrap dependency digest>=20010302: found digest-20111104
===> Building for gpart-0.1hnb1
/usr/bin/gnumake -C src
gcc -Wall -O2 -pedantic -DVERSION=\"0.1h\" -no-cpp-precomp -isystem /usr/include  -c -o gpart.o gpart.c
In file included from gpart.h:21,
                 from gpart.c:59:
l64seek.h:41: error: expected '=', ',', ';', 'asm' or '__attribute__' before 's64_t'
l64seek.h:43: error: expected '=', ',', ';', 'asm' or '__attribute__' before 'l64seek'
l64seek.h:46: error: expected '=', ',', ';', 'asm' or '__attribute__' before 'l64opop'
In file included from gpart.c:59:
gpart.h:134: error: expected specifier-qualifier-list before 's64_t'
gpart.h:152: error: expected specifier-qualifier-list before 's64_t'
gpart.c:69: error: expected declaration specifiers or '...' before 's64_t'
gpart.c:71: error: expected '=', ',', ';', 'asm' or '__attribute__' before 'skipsec'
gpart.c:72: warning: built-in function 'log' declared as non-function
gpart.c: In function 'is_sane_partentry':
gpart.c:341: error: 'disk_desc' has no member named 'd_nsecs'
gpart.c:346: error: 'disk_desc' has no member named 'd_nsecs'
gpart.c:351: error: 'disk_desc' has no member named 'd_nsecs'
gpart.c: At top level:
gpart.c:477: error: expected declaration specifiers or '...' before 's64_t'
gpart.c: In function 'fillin_dos_chs':
gpart.c:482: error: 'disk_desc' has no member named 'd_dg'
gpart.c:482: error: 'disk_desc' has no member named 'd_dg'
gpart.c:484: error: 'disk_desc' has no member named 'd_dg'
gpart.c:485: error: 'disk_desc' has no member named 'd_dg'
gpart.c:490: error: 'disk_desc' has no member named 'd_dg'
gpart.c:491: error: 'disk_desc' has no member named 'd_dg'
gpart.c:492: error: 'disk_desc' has no member named 'd_dg'
gpart.c:493: error: 'disk_desc' has no member named 'd_dg'
gpart.c:498: error: 'disk_desc' has no member named 'd_dg'
gpart.c:498: error: 'disk_desc' has no member named 'd_dg'
gpart.c:500: error: 'disk_desc' has no member named 'd_dg'
gpart.c:501: error: 'disk_desc' has no member named 'd_dg'
gpart.c:506: error: 'disk_desc' has no member named 'd_dg'
gpart.c:507: error: 'disk_desc' has no member named 'd_dg'
gpart.c:508: error: 'disk_desc' has no member named 'd_dg'
gpart.c:509: error: 'disk_desc' has no member named 'd_dg'
gpart.c: In function 'u_to_chs':
gpart.c:519: error: 'disk_desc' has no member named 'd_dg'
gpart.c:522: error: dereferencing pointer to incomplete type
gpart.c:522: error: dereferencing pointer to incomplete type
gpart.c:524: error: dereferencing pointer to incomplete type
gpart.c:524: error: dereferencing pointer to incomplete type
gpart.c:525: error: dereferencing pointer to incomplete type
gpart.c:525: error: dereferencing pointer to incomplete type
gpart.c:526: error: dereferencing pointer to incomplete type
gpart.c: At top level:
gpart.c:532: error: expected declaration specifiers or '...' before 's64_t'
gpart.c: In function 'on_cyl_boundary':
gpart.c:534: error: 'disk_desc' has no member named 'd_dg'
gpart.c:536: error: dereferencing pointer to incomplete type
gpart.c:536: error: dereferencing pointer to incomplete type
gpart.c:537: error: 'sec' undeclared (first use in this function)
gpart.c:537: error: (Each undeclared identifier is reported only once
gpart.c:537: error: for each function it appears in.)
gpart.c:537: error: dereferencing pointer to incomplete type
gpart.c:537: error: dereferencing pointer to incomplete type
gpart.c: At top level:
gpart.c:543: error: expected declaration specifiers or '...' before 's64_t'
gpart.c: In function 'on_head_boundary':
gpart.c:545: error: 'disk_desc' has no member named 'd_dg'
gpart.c:547: error: dereferencing pointer to incomplete type
gpart.c:548: error: 'sec' undeclared (first use in this function)
gpart.c:548: error: dereferencing pointer to incomplete type
gpart.c: At top level:
gpart.c:554: error: expected declaration specifiers or '...' before 's64_t'
gpart.c: In function 'print_partition':
gpart.c:557: error: 's64_t' undeclared (first use in this function)
gpart.c:557: error: expected ';' before 'size'
gpart.c:558: warning: ISO C90 forbids mixed declarations and code
gpart.c:562: error: 'size' undeclared (first use in this function)
gpart.c:570: error: expected ')' before 'p'
gpart.c:571: error: 'offset' undeclared (first use in this function)
gpart.c:573: error: expected ')' before 'p'
gpart.c: At top level:
gpart.c:597: error: expected declaration specifiers or '...' before 's64_t'
gpart.c: In function 'print_ext_partitions':
gpart.c:599: error: 'disk_desc' has no member named 'd_pt'
gpart.c:601: error: 's64_t' undeclared (first use in this function)
gpart.c:601: error: expected ';' before 'extst'
gpart.c:608: error: 'offset' undeclared (first use in this function)
gpart.c:608: error: 'extst' undeclared (first use in this function)
gpart.c:608: error: too many arguments to function 'print_partition'
gpart.c: In function 'print_ptable':
gpart.c:625: error: too many arguments to function 'print_partition'
gpart.c:627: error: too many arguments to function 'print_ext_partitions'
gpart.c: In function 'print_disk_desc':
gpart.c:635: error: 's64_t' undeclared (first use in this function)
gpart.c:635: error: expected ';' before 's'
gpart.c:640: error: 's' undeclared (first use in this function)
gpart.c:640: error: 'disk_desc' has no member named 'd_nsecs'
gpart.c:642: error: 'disk_desc' has no member named 'd_dg'
gpart.c:642: error: 'disk_desc' has no member named 'd_dg'
gpart.c:642: error: 'disk_desc' has no member named 'd_dg'
gpart.c:643: error: 'disk_desc' has no member named 'd_lba'
gpart.c:644: error: 'disk_desc' has no member named 'd_nsecs'
gpart.c:647: error: 'disk_desc' has no member named 'd_pt'
gpart.c:648: error: 'disk_desc' has no member named 'd_pt'
gpart.c:649: error: 'disk_desc' has no member named 'd_pt'
gpart.c: In function 'print_mboot_block':
gpart.c:657: error: 'disk_desc' has no member named 'd_pt'
gpart.c: At top level:
gpart.c:674: error: expected declaration specifiers or '...' before 's64_t'
gpart.c: In function 'read_part_table':
gpart.c:683: error: 'sec' undeclared (first use in this function)
gpart.c:684: warning: implicit declaration of function 'l64seek'
gpart.c: In function 'read_ext_part_table':
gpart.c:703: error: 's64_t' undeclared (first use in this function)
gpart.c:703: error: expected ';' before 'epsize'
gpart.c:704: warning: ISO C90 forbids mixed declarations and code
gpart.c:706: error: 'epsize' undeclared (first use in this function)
gpart.c:706: error: 'epstart' undeclared (first use in this function)
gpart.c:706: error: 'epoffset' undeclared (first use in this function)
gpart.c:747: error: too many arguments to function 'read_part_table'
gpart.c: In function 'free_disk_desc':
gpart.c:764: error: 'disk_desc' has no member named 'd_pt'
gpart.c:768: error: 'disk_desc' has no member named 'd_gpt'
gpart.c:772: error: 'disk_desc' has no member named 'd_gl'
gpart.c: In function 'get_disk_desc':
gpart.c:830: error: 'disk_desc' has no member named 'd_pt'
gpart.c:830: error: too many arguments to function 'read_part_table'
gpart.c:835: error: 'disk_desc' has no member named 'd_dg'
gpart.c:835: error: 'disk_desc' has no member named 'd_dg'
gpart.c:835: error: invalid application of 'sizeof' to incomplete type 'struct disk_geom' 
gpart.c:835: error: 'disk_desc' has no member named 'd_dg'
gpart.c:835: error: 'disk_desc' has no member named 'd_dg'
gpart.c:835: error: invalid application of 'sizeof' to incomplete type 'struct disk_geom' 
gpart.c:841: error: 'disk_desc' has no member named 'd_dg'
gpart.c:842: error: 'disk_desc' has no member named 'd_dg'
gpart.c:843: error: 'disk_desc' has no member named 'd_dg'
gpart.c:847: error: 'disk_desc' has no member named 'd_dg'
gpart.c:848: error: 'disk_desc' has no member named 'd_dg'
gpart.c:849: error: 'disk_desc' has no member named 'd_dg'
gpart.c:851: error: 'disk_desc' has no member named 'd_dg'
gpart.c:851: error: 'disk_desc' has no member named 'd_dosc'
gpart.c:852: error: 'disk_desc' has no member named 'd_dg'
gpart.c:852: error: 'disk_desc' has no member named 'd_dg'
gpart.c:852: error: 'disk_desc' has no member named 'd_lba'
gpart.c:853: error: 'disk_desc' has no member named 'd_nsecs'
gpart.c:853: error: 'disk_desc' has no member named 'd_dg'
gpart.c:854: error: 'disk_desc' has no member named 'd_nsecs'
gpart.c:854: error: 'disk_desc' has no member named 'd_dg'
gpart.c:855: error: 'disk_desc' has no member named 'd_nsecs'
gpart.c:855: error: 'disk_desc' has no member named 'd_dg'
gpart.c:856: error: 'disk_desc' has no member named 'd_pt'
gpart.c: In function 'add_guessed_p':
gpart.c:868: error: 'disk_desc' has no member named 'd_gl'
gpart.c:869: error: 'disk_desc' has no member named 'd_gl'
gpart.c:872: error: 'disk_desc' has no member named 'd_gl'
gpart.c:878: error: 'dos_guessed_pt' has no member named 'g_ext'
gpart.c:881: error: 'dos_guessed_pt' has no member named 'g_sec'
gpart.c:881: error: 'disk_desc' has no member named 'd_nsb'
gpart.c: In function 'mod_is_aligned':
gpart.c:908: error: 's64_t' undeclared (first use in this function)
gpart.c:908: error: expected ';' before 'al'
gpart.c:913: error: 'disk_desc' has no member named 'd_nsb'
gpart.c:913: error: too many arguments to function 'on_head_boundary'
gpart.c:916: error: 'disk_desc' has no member named 'd_nsb'
gpart.c:916: error: too many arguments to function 'on_cyl_boundary'
gpart.c:924: error: 'al' undeclared (first use in this function)
gpart.c:924: error: 'disk_desc' has no member named 'd_nsb'
gpart.c: In function 'do_guess_loop':
gpart.c:944: error: 's64_t' undeclared (first use in this function)
gpart.c:944: error: expected ';' before 'bincr'
gpart.c:945: warning: ISO C90 forbids mixed declarations and code
gpart.c:971: error: 'disk_desc' has no member named 'd_dg'
gpart.c:972: error: 'disk_desc' has no member named 'd_dg'
gpart.c:972: error: 'disk_desc' has no member named 'd_dg'
gpart.c:982: error: 'disk_desc' has no member named 'd_nsb'
gpart.c:983: error: 'bincr' undeclared (first use in this function)
gpart.c:985: error: 'start' undeclared (first use in this function)
gpart.c:985: error: 'skipsec' undeclared (first use in this function)
gpart.c:985: error: 'disk_desc' has no member named 'd_dg'
gpart.c:986: error: 'disk_desc' has no member named 'd_nsb'
gpart.c:1004: error: expected ';' before 'sz'
gpart.c:1006: error: 'disk_desc' has no member named 'd_nsb'
gpart.c:1006: error: 'noffset' undeclared (first use in this function)
gpart.c:1007: error: 'ofs' undeclared (first use in this function)
gpart.c:1007: error: 'disk_desc' has no member named 'd_nsb'
gpart.c:1008: error: 'maxsec' undeclared (first use in this function)
gpart.c:1008: error: 'disk_desc' has no member named 'd_nsb'
gpart.c:1034: error: 'sz' undeclared (first use in this function)
gpart.c:1034: warning: implicit declaration of function 'l64opop'
gpart.c:1045: error: too many arguments to function 'fillin_dos_chs'
gpart.c:1052: error: 'disk_desc' has no member named 'd_nsb'
gpart.c:1052: error: too many arguments to function 'boundary_fun'
gpart.c:1092: error: too many arguments to function 'print_partition'
gpart.c:1120: error: 'disk_desc' has no member named 'd_nsb'
gpart.c:1135: error: 'disk_desc' has no member named 'd_nsb'
gpart.c:1135: error: 'disk_desc' has no member named 'd_nsecs'
gpart.c:1141: error: 'disk_desc' has no member named 'd_nsb'
gpart.c:1146: error: 'disk_desc' has no member named 'd_nsb'
gpart.c:1158: error: 'disk_desc' has no member named 'd_nsb'
gpart.c:1163: error: 'disk_desc' has no member named 'd_nsb'
gpart.c:1166: error: 'disk_desc' has no member named 'd_nsb'
gpart.c: In function 'edit_partition':
gpart.c:1205: error: too many arguments to function 'fillin_dos_chs'
gpart.c:1209: error: too many arguments to function 'fillin_dos_chs'
gpart.c: In function 'make_mbr_backup':
gpart.c:1228: error: 'disk_desc' has no member named 'd_pt'
gpart.c: In function 'write_primary_ptbl':
gpart.c:1262: error: 'disk_desc' has no member named 'd_gpt'
gpart.c:1274: error: 'disk_desc' has no member named 'd_gpt'
gpart.c:1277: error: 'disk_desc' has no member named 'd_gpt'
gpart.c:1290: error: 'disk_desc' has no member named 'd_gpt'
gpart.c:1292: error: 'disk_desc' has no member named 'd_gpt'
gpart.c:1299: error: 'disk_desc' has no member named 'd_pt'
gpart.c:1299: error: 'disk_desc' has no member named 'd_pt'
gpart.c:1300: error: 'disk_desc' has no member named 'd_gpt'
gpart.c:1300: error: 'disk_desc' has no member named 'd_gpt'
gpart.c: In function 'warn_invalid':
gpart.c:1325: error: too many arguments to function 'print_partition'
gpart.c: In function 'check_partition_list':
gpart.c:1342: error: 's64_t' undeclared (first use in this function)
gpart.c:1342: error: expected ';' before 'size'
gpart.c:1353: error: 'ofs' undeclared (first use in this function)
gpart.c:1354: error: 'disk_desc' has no member named 'd_gl'
gpart.c:1356: error: 'dos_guessed_pt' has no member named 'g_ext'
gpart.c:1356: error: 'dos_guessed_pt' has no member named 'g_inv'
gpart.c:1358: error: 'disk_desc' has no member named 'd_gl'
gpart.c:1386: error: 'size' undeclared (first use in this function)
gpart.c:1388: error: 'disk_desc' has no member named 'd_gl'
gpart.c:1390: error: 'dos_guessed_pt' has no member named 'g_inv'
gpart.c:1391: error: 'dos_guessed_pt' has no member named 'g_ext'
gpart.c:1399: error: 'dos_guessed_pt' has no member named 'g_inv'
gpart.c:1411: error: 'dos_guessed_pt' has no member named 'g_inv'
gpart.c:1425: error: 'dos_guessed_pt' has no member named 'g_inv'
gpart.c:1442: error: 'dos_guessed_pt' has no member named 'g_ext'
gpart.c:1449: error: 'dos_guessed_pt' has no member named 'g_inv'
gpart.c:1454: error: 'dos_guessed_pt' has no member named 'g_log'
gpart.c:1466: error: 'dos_guessed_pt' has no member named 'g_inv'
gpart.c:1472: error: 'dos_guessed_pt' has no member named 'g_inv'
gpart.c:1482: error: 'dos_guessed_pt' has no member named 'g_prim'
gpart.c:1486: error: 'dos_guessed_pt' has no member named 'g_inv'
gpart.c:1493: error: 'dos_guessed_pt' has no member named 'g_inv'
gpart.c:1508: error: 'dos_guessed_pt' has no member named 'g_inv'
gpart.c:1525: error: 'disk_desc' has no member named 'd_gl'
gpart.c:1527: error: 'dos_guessed_pt' has no member named 'g_inv'
gpart.c:1528: error: 'dos_guessed_pt' has no member named 'g_ext'
gpart.c:1532: error: 'dos_guessed_pt' has no member named 'g_sec'
gpart.c:1544: error: 'dos_guessed_pt' has no member named 'g_sec'
gpart.c:1545: error: 'struct dos_gp' has no member named 'g_orph'
gpart.c:1562: error: 'disk_desc' has no member named 'd_gl'
gpart.c:1564: error: 'dos_guessed_pt' has no member named 'g_ext'
gpart.c:1566: error: 'dos_guessed_pt' has no member named 'g_log'
gpart.c:1568: error: 'dos_guessed_pt' has no member named 'g_inv'
gpart.c:1569: error: 'dos_guessed_pt' has no member named 'g_orph'
gpart.c:1570: error: 'dos_guessed_pt' has no member named 'g_prim'
gpart.c:1571: error: 'dos_guessed_pt' has no member named 'g_log'
gpart.c:1574: error: 'dos_guessed_pt' has no member named 'g_log'
gpart.c:1574: error: too many arguments to function 'print_partition'
gpart.c:1582: error: 'disk_desc' has no member named 'd_gpt'
gpart.c:1582: error: 'disk_desc' has no member named 'd_gpt'
gpart.c:1582: error: 'disk_desc' has no member named 'd_gpt'
gpart.c:1582: error: 'disk_desc' has no member named 'd_gpt'
gpart.c:1583: error: 'disk_desc' has no member named 'd_gl'
gpart.c:1586: error: 'dos_guessed_pt' has no member named 'g_inv'
gpart.c:1587: error: 'dos_guessed_pt' has no member named 'g_ext'
gpart.c:1594: error: 'disk_desc' has no member named 'd_gpt'
gpart.c:1597: error: 'disk_desc' has no member named 'd_lba'
gpart.c:1599: error: too many arguments to function 'fillin_dos_chs'
gpart.c:1605: error: 'dos_guessed_pt' has no member named 'g_prim'
gpart.c:1606: error: 'disk_desc' has no member named 'd_gpt'
gpart.c:1606: error: 'disk_desc' has no member named 'd_gpt'
gpart.c:1606: error: 'disk_desc' has no member named 'd_gpt'
gpart.c:1606: error: 'disk_desc' has no member named 'd_gpt'
gpart.c:1618: error: 'disk_desc' has no member named 'd_gpt'
gpart.c:1634: error: too many arguments to function 'print_partition'
gpart.c:1642: error: 'disk_desc' has no member named 'd_gpt'
gpart.c: In function 'compare_parttables':
gpart.c:1667: error: 'disk_desc' has no member named 'd_pt'
gpart.c:1670: error: 'disk_desc' has no member named 'd_gpt'
gpart.c: In function 'main':
gpart.c:1733: error: 'maxsec' undeclared (first use in this function)
gpart.c:1739: error: 'skipsec' undeclared (first use in this function)
gpart.c:1822: error: 'disk_desc' has no member named 'd_gpt'
gnumake[1]: *** [gpart.o] Error 1
gnumake: *** [gpart] Error 2
*** Error code 2

Stop.
bmake: stopped in /Users/kristerw/pbulk/pkgsrc/sysutils/gpart
*** Error code 1

Stop.
bmake: stopped in /Users/kristerw/pbulk/pkgsrc/sysutils/gpart