=> Bootstrap dependency digest>=20010302: found digest-20111104
WARNING: [license.mk] Every package should define a LICENSE.
===> Building for malsync-2.2.0nb1
gcc -Wall -g -DMALSYNC -I./mal/common -I./mal/client/common -I/usr/pkg/include -I./mal/client/unix --traditional-cpp -DDARWIN -D__unix__ -D__FreeBSD__ -D_HPUX_SOURCE -D__unix__=1 -no-cpp-precomp -isystem /usr/include -I/usr/pkg/include -I/usr/include  -c -o malsync.o malsync.c
In file included from /usr/include/stdio.h:500,
                 from malsync.c:30:
/usr/include/secure/_stdio.h:48: error: syntax error in macro parameter list
/usr/include/secure/_stdio.h:55: error: syntax error in macro parameter list
gnumake: *** [malsync.o] Error 1
*** Error code 2

Stop.
bmake: stopped in /Users/kristerw/pbulk/pkgsrc/comms/malsync
*** Error code 1

Stop.
bmake: stopped in /Users/kristerw/pbulk/pkgsrc/comms/malsync