=> Bootstrap dependency digest>=20010302: found digest-20111104
WARNING: [license.mk] Every package should define a LICENSE.
===> Building for icewm-1.2.35nb1
  CXX      ymsgbox.o
In file included from ylib.h:9,
                 from ymsgbox.cc:12:
/Users/kristerw/pbulk/scratch/wm/icewm/work/.buildlink/include/X11/Xlib.h:1694: error: 'deprecated' was not declared in this scope
/Users/kristerw/pbulk/scratch/wm/icewm/work/.buildlink/include/X11/Xlib.h:1703: warning: '__attribute__' attribute directive ignored
In file included from /Users/kristerw/pbulk/scratch/wm/icewm/work/.x11-buildlink/include/freetype2/freetype/config/ftstdlib.h:119,
                 from /Users/kristerw/pbulk/scratch/wm/icewm/work/.x11-buildlink/include/freetype2/freetype/config/ftconfig.h:43,
                 from /Users/kristerw/pbulk/scratch/wm/icewm/work/.x11-buildlink/include/freetype2/freetype/freetype.h:33,
                 from /Users/kristerw/pbulk/scratch/wm/icewm/work/.buildlink/include/X11/Xft/Xft.h:40,
                 from ypaint.h:24,
                 from ywindow.h:4,
                 from wmclient.h:5,
                 from ydialog.h:4,
                 from ymsgbox.h:4,
                 from ymsgbox.cc:13:
/usr/include/stdlib.h:292: error: 'deprecated' was not declared in this scope
In file included from /Users/kristerw/pbulk/scratch/wm/icewm/work/.buildlink/include/fontconfig/fontconfig.h:29,
                 from /Users/kristerw/pbulk/scratch/wm/icewm/work/.buildlink/include/X11/Xft/Xft.h:41,
                 from ypaint.h:24,
                 from ywindow.h:4,
                 from wmclient.h:5,
                 from ydialog.h:4,
                 from ymsgbox.h:4,
                 from ymsgbox.cc:13:
/usr/include/sys/stat.h:457: error: 'deprecated' was not declared in this scope
/usr/include/sys/stat.h:461: error: 'deprecated' was not declared in this scope
/usr/include/sys/stat.h:462: error: 'deprecated' was not declared in this scope
/usr/include/sys/stat.h:463: error: 'deprecated' was not declared in this scope
/usr/include/sys/stat.h:464: error: 'deprecated' was not declared in this scope
/usr/include/sys/stat.h:465: error: 'deprecated' was not declared in this scope
/usr/include/sys/stat.h:466: error: 'deprecated' was not declared in this scope
gnumake[1]: *** [ymsgbox.o] Error 1
gnumake: *** [base] Error 2
*** Error code 2

Stop.
bmake: stopped in /Users/kristerw/pbulk/pkgsrc/wm/icewm
*** Error code 1

Stop.
bmake: stopped in /Users/kristerw/pbulk/pkgsrc/wm/icewm