=> Bootstrap dependency digest>=20010302: found digest-20111104
===> Building for aide-0.15.1
/usr/bin/gnumake  all-recursive
Making all in include
gnumake[2]: Nothing to be done for `all'.
Making all in src
/usr/bin/gnumake  all-am
gcc -DHAVE_CONFIG_H -I. -I.. -I.. -I../include -I../src -I../src  -no-cpp-precomp -isystem /usr/include -I/usr/include -I/usr/pkg/include -D_GNU_SOURCE -D_LARGEFILE_SOURCE -D_LARGEFILE64_SOURCE -D_FILE_OFFSET_BITS=64 -W -Wall -g -pipe -O2 -I/usr/include -I/usr/pkg/include  -MT aide.o -MD -MP -MF .deps/aide.Tpo -c -o aide.o aide.c
In file included from /Users/kristerw/pbulk/scratch/security/aide/work/.buildlink/include/mutils/mincludes.h:34,
                 from /Users/kristerw/pbulk/scratch/security/aide/work/.buildlink/include/mhash.h:6,
                 from ../include/db_config.h:94,
                 from ../include/aide.h:26,
                 from aide.c:22:
/Users/kristerw/pbulk/scratch/security/aide/work/.buildlink/include/mutils/mhash_config.h:210:1: warning: "VERSION" redefined
In file included from ../include/aide.h:24,
                 from aide.c:22:
../config.h:358:1: warning: this is the location of the previous definition
In file included from ../include/aide.h:26,
                 from aide.c:22:
../include/db_config.h:386: error: expected specifier-qualifier-list before 'off64_t'
gnumake[3]: *** [aide.o] Error 1
gnumake[2]: *** [all] Error 2
gnumake[1]: *** [all-recursive] Error 1
gnumake: *** [all] Error 2
*** Error code 2

Stop.
bmake: stopped in /Users/kristerw/pbulk/pkgsrc/security/aide
*** Error code 1

Stop.
bmake: stopped in /Users/kristerw/pbulk/pkgsrc/security/aide