=> Bootstrap dependency digest>=20010302: found digest-20190127
===> Skipping vulnerability checks.
WARNING: No /var/db/pkg/pkg-vulnerabilities file found.
WARNING: To fix run: `/usr/sbin/pkg_admin -K /var/db/pkg fetch-pkg-vulnerabilities'.
===> Building for zoneminder-1.29.0nb4
/usr/pkg/bin/gmake  all-recursive
gmake[1]: Entering directory '/data/scratch/security/zoneminder/work/zoneminder-1.29.0'
Making all in src
gmake[2]: Entering directory '/data/scratch/security/zoneminder/work/zoneminder-1.29.0/src'
clang++ -DHAVE_CONFIG_H -I. -I..  -I/usr/pkg/include -I/usr/include -I/usr/pkg/include -D__STDC_CONSTANT_MACROS -Wall -finline-functions -fomit-frame-pointer -I/usr/pkg/include -D__STDC_CONSTANT_MACROS -I/usr/include -I/usr/pkg/include/ffmpeg2 -I/usr/pkg/include/freetype2 -I/usr/pkg/include -I/usr/pkg/include/apr-1 -I/usr/pkg/include/mysql -D__STDC_CONSTANT_MACROS -O2 -D__STDC_CONSTANT_MACROS -pthread -I/usr/include -I/usr/pkg/include/ffmpeg2 -I/usr/pkg/include/freetype2 -I/usr/pkg/include -I/usr/pkg/include/apr-1 -I/usr/pkg/include/mysql -c -o zmc.o zmc.cpp
clang++ -DHAVE_CONFIG_H -I. -I..  -I/usr/pkg/include -I/usr/include -I/usr/pkg/include -D__STDC_CONSTANT_MACROS -Wall -finline-functions -fomit-frame-pointer -I/usr/pkg/include -D__STDC_CONSTANT_MACROS -I/usr/include -I/usr/pkg/include/ffmpeg2 -I/usr/pkg/include/freetype2 -I/usr/pkg/include -I/usr/pkg/include/apr-1 -I/usr/pkg/include/mysql -D__STDC_CONSTANT_MACROS -O2 -D__STDC_CONSTANT_MACROS -pthread -I/usr/include -I/usr/pkg/include/ffmpeg2 -I/usr/pkg/include/freetype2 -I/usr/pkg/include -I/usr/pkg/include/apr-1 -I/usr/pkg/include/mysql -c -o zm_box.o zm_box.cpp
clang++ -DHAVE_CONFIG_H -I. -I..  -I/usr/pkg/include -I/usr/include -I/usr/pkg/include -D__STDC_CONSTANT_MACROS -Wall -finline-functions -fomit-frame-pointer -I/usr/pkg/include -D__STDC_CONSTANT_MACROS -I/usr/include -I/usr/pkg/include/ffmpeg2 -I/usr/pkg/include/freetype2 -I/usr/pkg/include -I/usr/pkg/include/apr-1 -I/usr/pkg/include/mysql -D__STDC_CONSTANT_MACROS -O2 -D__STDC_CONSTANT_MACROS -pthread -I/usr/include -I/usr/pkg/include/ffmpeg2 -I/usr/pkg/include/freetype2 -I/usr/pkg/include -I/usr/pkg/include/apr-1 -I/usr/pkg/include/mysql -c -o zm_buffer.o zm_buffer.cpp
clang++ -DHAVE_CONFIG_H -I. -I..  -I/usr/pkg/include -I/usr/include -I/usr/pkg/include -D__STDC_CONSTANT_MACROS -Wall -finline-functions -fomit-frame-pointer -I/usr/pkg/include -D__STDC_CONSTANT_MACROS -I/usr/include -I/usr/pkg/include/ffmpeg2 -I/usr/pkg/include/freetype2 -I/usr/pkg/include -I/usr/pkg/include/apr-1 -I/usr/pkg/include/mysql -D__STDC_CONSTANT_MACROS -O2 -D__STDC_CONSTANT_MACROS -pthread -I/usr/include -I/usr/pkg/include/ffmpeg2 -I/usr/pkg/include/freetype2 -I/usr/pkg/include -I/usr/pkg/include/apr-1 -I/usr/pkg/include/mysql -c -o zm_camera.o zm_camera.cpp
clang++ -DHAVE_CONFIG_H -I. -I..  -I/usr/pkg/include -I/usr/include -I/usr/pkg/include -D__STDC_CONSTANT_MACROS -Wall -finline-functions -fomit-frame-pointer -I/usr/pkg/include -D__STDC_CONSTANT_MACROS -I/usr/include -I/usr/pkg/include/ffmpeg2 -I/usr/pkg/include/freetype2 -I/usr/pkg/include -I/usr/pkg/include/apr-1 -I/usr/pkg/include/mysql -D__STDC_CONSTANT_MACROS -O2 -D__STDC_CONSTANT_MACROS -pthread -I/usr/include -I/usr/pkg/include/ffmpeg2 -I/usr/pkg/include/freetype2 -I/usr/pkg/include -I/usr/pkg/include/apr-1 -I/usr/pkg/include/mysql -c -o zm_comms.o zm_comms.cpp
clang++ -DHAVE_CONFIG_H -I. -I..  -I/usr/pkg/include -I/usr/include -I/usr/pkg/include -D__STDC_CONSTANT_MACROS -Wall -finline-functions -fomit-frame-pointer -I/usr/pkg/include -D__STDC_CONSTANT_MACROS -I/usr/include -I/usr/pkg/include/ffmpeg2 -I/usr/pkg/include/freetype2 -I/usr/pkg/include -I/usr/pkg/include/apr-1 -I/usr/pkg/include/mysql -D__STDC_CONSTANT_MACROS -O2 -D__STDC_CONSTANT_MACROS -pthread -I/usr/include -I/usr/pkg/include/ffmpeg2 -I/usr/pkg/include/freetype2 -I/usr/pkg/include -I/usr/pkg/include/apr-1 -I/usr/pkg/include/mysql -c -o zm_config.o zm_config.cpp
clang++ -DHAVE_CONFIG_H -I. -I..  -I/usr/pkg/include -I/usr/include -I/usr/pkg/include -D__STDC_CONSTANT_MACROS -Wall -finline-functions -fomit-frame-pointer -I/usr/pkg/include -D__STDC_CONSTANT_MACROS -I/usr/include -I/usr/pkg/include/ffmpeg2 -I/usr/pkg/include/freetype2 -I/usr/pkg/include -I/usr/pkg/include/apr-1 -I/usr/pkg/include/mysql -D__STDC_CONSTANT_MACROS -O2 -D__STDC_CONSTANT_MACROS -pthread -I/usr/include -I/usr/pkg/include/ffmpeg2 -I/usr/pkg/include/freetype2 -I/usr/pkg/include -I/usr/pkg/include/apr-1 -I/usr/pkg/include/mysql -c -o zm_coord.o zm_coord.cpp
clang++ -DHAVE_CONFIG_H -I. -I..  -I/usr/pkg/include -I/usr/include -I/usr/pkg/include -D__STDC_CONSTANT_MACROS -Wall -finline-functions -fomit-frame-pointer -I/usr/pkg/include -D__STDC_CONSTANT_MACROS -I/usr/include -I/usr/pkg/include/ffmpeg2 -I/usr/pkg/include/freetype2 -I/usr/pkg/include -I/usr/pkg/include/apr-1 -I/usr/pkg/include/mysql -D__STDC_CONSTANT_MACROS -O2 -D__STDC_CONSTANT_MACROS -pthread -I/usr/include -I/usr/pkg/include/ffmpeg2 -I/usr/pkg/include/freetype2 -I/usr/pkg/include -I/usr/pkg/include/apr-1 -I/usr/pkg/include/mysql -c -o zm_curl_camera.o zm_curl_camera.cpp
In file included from zm_buffer.cpp:23:
In file included from ./zm.h:27:
In file included from ./zm_config.h:26:
In file included from /usr/include/c++/string:506:
In file included from /usr/include/c++/string_view:175:
In file included from /usr/include/c++/__string:57:
In file included from /usr/include/c++/algorithm:639:
In file included from /usr/include/c++/initializer_list:46:
In file included from /usr/include/c++/cstddef:37:
../version:1:1: error: expected unqualified-id
1.29.0
^
In file included from zm_buffer.cpp:23:
In file included from ./zm.h:27:
In file included from ./zm_config.h:26:
In file included from /usr/include/c++/string:506:
In file included from /usr/include/c++/string_view:175:
In file included from /usr/include/c++/__string:57:
In file included from /usr/include/c++/algorithm:639:
In file included from /usr/include/c++/initializer_list:46:
In file included from /usr/include/c++/cstddef:44:
/usr/include/stddef.h:75:3: error: C++ requires a type specifier for all declarations
} max_align_t;
  ^
In file included from zm_camera.cpp:20:
In file included from ./zm.h:27:
In file included from ./zm_config.h:26:
In file included from /usr/include/c++/string:506:
In file included from /usr/include/c++/string_view:175:
In file included from /usr/include/c++/__string:57:
In file included from /usr/include/c++/algorithm:639:
In file included from /usr/include/c++/initializer_list:46:
In file included from /usr/include/c++/cstddef:37:
../version:1:1: error: expected unqualified-id
1.29.0
^
In file included from zm_camera.cpp:20:
In file included from ./zm.h:27:
In file included from ./zm_config.h:26:
In file included from /usr/include/c++/string:506:
In file included from /usr/include/c++/string_view:175:
In file included from /usr/include/c++/__string:57:
In file included from /usr/include/c++/algorithm:639:
In file included from /usr/include/c++/initializer_list:46:
In file included from /usr/include/c++/cstddef:44:
/usr/include/stddef.h:75:3: error: C++ requires a type specifier for all declarations
} max_align_t;
  ^
In file included from zm_buffer.cpp:23:
In file included from ./zm.h:27:
In file included from ./zm_config.h:26:
In file included from /usr/include/c++/string:506:
In file included from /usr/include/c++/string_view:175:
In file included from /usr/include/c++/__string:57:
In file included from /usr/include/c++/algorithm:640:
In file included from /usr/include/c++/type_traits:418:
../version:1:1: error: expected unqualified-id
1.29.0
^
In file included from zm_camera.cpp:20:
In file included from ./zm.h:27:
In file included from ./zm_config.h:26:
In file included from /usr/include/c++/string:506:
In file included from /usr/include/c++/string_view:175:
In file included from /usr/include/c++/__string:57:
In file included from /usr/include/c++/algorithm:640:
In file included from /usr/include/c++/type_traits:418:
../version:1:1: error: expected unqualified-id
1.29.0
^
In file included from zmc.cpp:70:
In file included from ./zm.h:27:
In file included from ./zm_config.h:26:
In file included from /usr/include/c++/string:506:
In file included from /usr/include/c++/string_view:175:
In file included from /usr/include/c++/__string:57:
In file included from /usr/include/c++/algorithm:639:
In file included from /usr/include/c++/initializer_list:46:
In file included from /usr/include/c++/cstddef:37:
../version:1:1: error: expected unqualified-id
1.29.0
^
In file included from zmc.cpp:70:
In file included from ./zm.h:27:
In file included from ./zm_config.h:26:
In file included from /usr/include/c++/string:506:
In file included from /usr/include/c++/string_view:175:
In file included from /usr/include/c++/__string:57:
In file included from /usr/include/c++/algorithm:639:
In file included from /usr/include/c++/initializer_list:46:
In file included from /usr/include/c++/cstddef:44:
/usr/include/stddef.h:75:3: error: C++ requires a type specifier for all declarations
} max_align_t;
  ^
In file included from zmc.cpp:70:
In file included from ./zm.h:27:
In file included from ./zm_config.h:26:
In file included from /usr/include/c++/string:506:
In file included from /usr/include/c++/string_view:175:
In file included from /usr/include/c++/__string:57:
In file included from /usr/include/c++/algorithm:640:
In file included from /usr/include/c++/type_traits:418:
../version:1:1: error: expected unqualified-id
1.29.0
^
In file included from zm_comms.cpp:20:
In file included from ./zm_comms.h:23:
In file included from ./zm_exception.h:23:
In file included from ./zm.h:27:
In file included from ./zm_config.h:26:
In file included from /usr/include/c++/string:506:
In file included from /usr/include/c++/string_view:175:
In file included from /usr/include/c++/__string:57:
In file included from /usr/include/c++/algorithm:639:
In file included from /usr/include/c++/initializer_list:46:
In file included from /usr/include/c++/cstddef:37:
../version:1:1: error: expected unqualified-id
1.29.0
^
In file included from zm_comms.cpp:20:
In file included from ./zm_comms.h:23:
In file included from ./zm_exception.h:23:
In file included from ./zm.h:27:
In file included from ./zm_config.h:26:
In file included from /usr/include/c++/string:506:
In file included from /usr/include/c++/string_view:175:
In file included from /usr/include/c++/__string:57:
In file included from /usr/include/c++/algorithm:639:
In file included from /usr/include/c++/initializer_list:46:
In file included from /usr/include/c++/cstddef:44:
/usr/include/stddef.h:75:3: error: C++ requires a type specifier for all declarations
} max_align_t;
  ^
In file included from zm_comms.cpp:20:
In file included from ./zm_comms.h:23:
In file included from ./zm_exception.h:23:
In file included from ./zm.h:27:
In file included from ./zm_config.h:26:
In file included from /usr/include/c++/string:506:
In file included from /usr/include/c++/string_view:175:
In file included from /usr/include/c++/__string:57:
In file included from /usr/include/c++/algorithm:640:
In file included from /usr/include/c++/type_traits:418:
../version:1:1: error: expected unqualified-id
1.29.0
^
In file included from zm_coord.cpp:20:
In file included from ./zm.h:27:
In file included from ./zm_config.h:26:
In file included from /usr/include/c++/string:506:
In file included from /usr/include/c++/string_view:175:
In file included from /usr/include/c++/__string:57:
In file included from /usr/include/c++/algorithm:639:
In file included from /usr/include/c++/initializer_list:46:
In file included from /usr/include/c++/cstddef:37:
../version:1:1: error: expected unqualified-id
1.29.0
^
In file included from zm_coord.cpp:20:
In file included from ./zm.h:27:
In file included from ./zm_config.h:26:
In file included from /usr/include/c++/string:506:
In file included from /usr/include/c++/string_view:175:
In file included from /usr/include/c++/__string:57:
In file included from /usr/include/c++/algorithm:639:
In file included from /usr/include/c++/initializer_list:46:
In file included from /usr/include/c++/cstddef:44:
/usr/include/stddef.h:75:3: error: C++ requires a type specifier for all declarations
} max_align_t;
  ^
In file included from zm_coord.cpp:20:
In file included from ./zm.h:27:
In file included from ./zm_config.h:26:
In file included from /usr/include/c++/string:506:
In file included from /usr/include/c++/string_view:175:
In file included from /usr/include/c++/__string:57:
In file included from /usr/include/c++/algorithm:640:
In file included from /usr/include/c++/type_traits:418:
../version:1:1: error: expected unqualified-id
1.29.0In file included from 
^zm_box.cpp
:In file included from 20zm_config.cpp:
:In file included from 20./zm.h::
27:
In file included from In file included from ./zm.h./zm_config.h::2627:
:
In file included from In file included from /usr/include/c++/string./zm_config.h::50626:
:
In file included from /usr/include/c++/string_viewIn file included from :175/usr/include/c++/string::
506In file included from :
In file included from /usr/include/c++/__string:/usr/include/c++/string_view57:175:
:
In file included from In file included from /usr/include/c++/algorithm/usr/include/c++/__string:639::
57:
In file included from In file included from /usr/include/c++/algorithm/usr/include/c++/initializer_list::63946:
:
In file included from In file included from /usr/include/c++/cstddef:/usr/include/c++/initializer_list:3746:
../version:
:1In file included from :1/usr/include/c++/cstddef:: 37:
error../version:: 1expected unqualified-id:
1: error1.29.0: 
^expected unqualified-id

1.29.0
^
In file included from zm_box.cpp:In file included from 20zm_config.cpp:
In file included from :./zm.h20:27:
:
In file included from In file included from ./zm_config.h:./zm.h26:27:
:
In file included from In file included from /usr/include/c++/string./zm_config.h::50626:
:
In file included from In file included from /usr/include/c++/string_view/usr/include/c++/string::175:
506In file included from :
In file included from In file included from /usr/include/c++/__stringzm_curl_camera.cpp::57/usr/include/c++/string_view20::
:
In file included from /usr/include/c++/algorithm175:In file included from 639:
In file included from ./zm.h:
:In file included from 27/usr/include/c++/initializer_list/usr/include/c++/__string:::
46In file included from 57./zm_config.h:
:In file included from :
/usr/include/c++/algorithm26:In file included from 639/usr/include/c++/cstddef:
:In file included from 44:
/usr/include/c++/initializer_list:
/usr/include/stddef.h::46In file included from :
75:/usr/include/c++/string3:In file included from 506::
 /usr/include/c++/cstddeferror:: In file included from C++ requires a type specifier for all declarations44/usr/include/c++/string_view:

/usr/include/stddef.h::175} max_align_t;75
:
:  ^3In file included from 
:/usr/include/c++/__string :error57: :
C++ requires a type specifier for all declarationsIn file included from 
/usr/include/c++/algorithm:639:
} max_align_t;In file included from 
/usr/include/c++/initializer_list  ^:46
:
In file included from /usr/include/c++/cstddef:37:
../version:1:1: error: expected unqualified-id
1.29.0
^
In file included from zm_curl_camera.cpp:20:
In file included from ./zm.h:27:
In file included from ./zm_config.h:26:
In file included from /usr/include/c++/string:506:
In file included from /usr/include/c++/string_view:175:
In file included from /usr/include/c++/__string:57:
In file included from /usr/include/c++/algorithm:639:
In file included from /usr/include/c++/initializer_list:46:
In file included from /usr/include/c++/cstddef:44:
/usr/include/stddef.h:75:3: error: C++ requires a type specifier for all declarations
} max_align_t;
  ^
In file included from In file included from zm_config.cppzm_box.cpp::2020:
In file included from :
./zm.hIn file included from :./zm.h27::
27In file included from :
./zm_config.h:In file included from 26./zm_config.h:
In file included from :/usr/include/c++/string26::
506In file included from :
/usr/include/c++/string:In file included from 506/usr/include/c++/string_view:
:In file included from 175/usr/include/c++/string_view:
:In file included from 175/usr/include/c++/__string::
57In file included from :
/usr/include/c++/__stringIn file included from :/usr/include/c++/algorithm57::
640In file included from :
/usr/include/c++/algorithmIn file included from :640/usr/include/c++/type_traits::
418In file included from :
/usr/include/c++/type_traits../version::4181:
:1: ../versionerror:: 1expected unqualified-id:
1:1.29.0 
error^: 
expected unqualified-id
1.29.0
^
In file included from zm_curl_camera.cpp:20:
In file included from ./zm.h:27:
In file included from ./zm_config.h:26:
In file included from /usr/include/c++/string:506:
In file included from /usr/include/c++/string_view:175:
In file included from /usr/include/c++/__string:57:
In file included from /usr/include/c++/algorithm:640:
In file included from /usr/include/c++/type_traits:418:
../version:1:1: error: expected unqualified-id
1.29.0
^
In file included from zm_camera.cpp:20:
In file included from ./zm.h:27:
In file included from ./zm_config.h:26:
In file included from /usr/include/c++/string:506:
In file included from /usr/include/c++/string_view:175:
In file included from /usr/include/c++/__string:57:
In file included from /usr/include/c++/algorithm:642:
In file included from /usr/include/c++/utility:205:
../version:1:1: error: expected unqualified-id
1.29.0
^
In file included from zm_camera.cpp:20:
In file included from ./zm.h:27:
In file included from ./zm_config.h:26:
In file included from /usr/include/c++/string:506:
In file included from /usr/include/c++/string_view:175:
In file included from /usr/include/c++/__string:57:
In file included from /usr/include/c++/algorithm:642:
In file included from /usr/include/c++/utility:206:
In file included from /usr/include/c++/__debug:14:
In file included from /usr/include/c++/iosfwd:95:
In file included from /usr/include/c++/wchar.h:118:
In file included from /usr/include/wchar.h:67:
In file included from /usr/include/c++/stdio.h:107:
/usr/include/stdio.h:77:3: error: C++ requires a type specifier for all declarations
} fpos_t;
  ^
/usr/include/stdio.h:291:33: error: unknown type name 'fpos_t'
int      fgetpos(FILE * __restrict, fpos_t * __restrict) __RENAME(__fgetpos50);
                                    ^
/usr/include/stdio.h:292:28: error: unknown type name 'fpos_t'
int      fsetpos(FILE *, const fpos_t *) __RENAME(__fsetpos50);
                               ^
In file included from zm_buffer.cpp:23:
In file included from ./zm.h:27:
In file included from ./zm_config.h:26:
In file included from /usr/include/c++/string:506:
In file included from /usr/include/c++/string_view:175:
In file included from /usr/include/c++/__string:57:
In file included from /usr/include/c++/algorithm:642:
In file included from /usr/include/c++/utility:205:
../version:1:1: error: expected unqualified-id
1.29.0
^
In file included from zm_buffer.cpp:23:
In file included from ./zm.h:27:
In file included from ./zm_config.h:26:
In file included from /usr/include/c++/string:506:
In file included from /usr/include/c++/string_view:175:
In file included from /usr/include/c++/__string:57:
In file included from /usr/include/c++/algorithm:642:
In file included from /usr/include/c++/utility:206:
In file included from /usr/include/c++/__debug:14:
In file included from /usr/include/c++/iosfwd:95:
In file included from /usr/include/c++/wchar.h:118:
In file included from /usr/include/wchar.h:67:
In file included from /usr/include/c++/stdio.h:107:
/usr/include/stdio.h:77:3: error: C++ requires a type specifier for all declarations
} fpos_t;
  ^
/usr/include/stdio.h:291:33: error: unknown type name 'fpos_t'
int      fgetpos(FILE * __restrict, fpos_t * __restrict) __RENAME(__fgetpos50);
                                    ^
/usr/include/stdio.h:292:28: error: unknown type name 'fpos_t'
int      fsetpos(FILE *, const fpos_t *) __RENAME(__fsetpos50);
                               ^
In file included from zm_comms.cpp:20:
In file included from ./zm_comms.h:23:
In file included from ./zm_exception.h:23:
In file included from ./zm.h:27:
In file included from ./zm_config.h:26:
In file included from /usr/include/c++/string:506:
In file included from /usr/include/c++/string_view:175:
In file included from /usr/include/c++/__string:57:
In file included from /usr/include/c++/algorithm:642:
In file included from /usr/include/c++/utility:205:
../version:1:1: error: expected unqualified-id
1.29.0
^
In file included from zm_comms.cpp:20:
In file included from ./zm_comms.h:23:
In file included from ./zm_exception.h:23:
In file included from ./zm.h:27:
In file included from ./zm_config.h:26:
In file included from /usr/include/c++/string:506:
In file included from /usr/include/c++/string_view:175:
In file included from /usr/include/c++/__string:57:
In file included from /usr/include/c++/algorithm:642:
In file included from /usr/include/c++/utility:206:
In file included from /usr/include/c++/__debug:14:
In file included from /usr/include/c++/iosfwd:95:
In file included from /usr/include/c++/wchar.h:118:
In file included from /usr/include/wchar.h:67:
In file included from /usr/include/c++/stdio.h:107:
/usr/include/stdio.h:77:3: error: C++ requires a type specifier for all declarations
} fpos_t;
  ^
In file included from zmc.cpp:70:
In file included from ./zm.h:27:
In file included from ./zm_config.h:26:
In file included from /usr/include/c++/string:506:
In file included from /usr/include/c++/string_view:175:
In file included from /usr/include/c++/__string:57:
In file included from /usr/include/c++/algorithm:642:
In file included from /usr/include/c++/utility:205:
../version:1:1: error: expected unqualified-id
1.29.0
^
In file included from zmc.cpp:70:
In file included from ./zm.h:27:
In file included from ./zm_config.h:26:
In file included from /usr/include/c++/string:506:
In file included from /usr/include/c++/string_view:175:
In file included from /usr/include/c++/__string:57:
In file included from /usr/include/c++/algorithm:642:
In file included from /usr/include/c++/utility:206:
In file included from /usr/include/c++/__debug:14:
In file included from /usr/include/c++/iosfwd:95:
In file included from /usr/include/c++/wchar.h:118:
In file included from /usr/include/wchar.h:67:
In file included from /usr/include/c++/stdio.h:107:
/usr/include/stdio.h:77/usr/include/stdio.h::3291:: 33error::  C++ requires a type specifier for all declarationserror
: unknown type name 'fpos_t'} fpos_t;

  ^
int      fgetpos(FILE * __restrict, fpos_t * __restrict) __RENAME(__fgetpos50);
                                    ^
/usr/include/stdio.h:292:28: error: unknown type name 'fpos_t'
int      fsetpos(FILE *, const fpos_t *) __RENAME(__fsetpos50);
                               ^
In file included from zm_coord.cpp:20:
In file included from ./zm.h:27:
In file included from ./zm_config.h:26:
In file included from /usr/include/c++/string:506:
In file included from /usr/include/c++/string_view:175:
In file included from /usr/include/c++/__string:57:
In file included from /usr/include/c++/algorithm:642:
In file included from /usr/include/c++/utility:205:
../version:1:1: error: expected unqualified-id
1.29.0
^
In file included from zm_coord.cpp:20:
In file included from ./zm.h:27:
In file included from ./zm_config.h:26:
In file included from /usr/include/c++/string:506:
In file included from /usr/include/c++/string_view:175:
In file included from /usr/include/c++/__string:57:
In file included from /usr/include/c++/algorithm:642:
In file included from /usr/include/c++/utility:206:
In file included from /usr/include/c++/__debug:14:
In file included from /usr/include/c++/iosfwd:95:
In file included from /usr/include/c++/wchar.h:118:
In file included from /usr/include/wchar.h:67:
In file included from /usr/include/c++/stdio.h:107:
/usr/include/stdio.h:77:3: error: C++ requires a type specifier for all declarations
} fpos_t;
  ^
/usr/include/stdio.h:291:33: error: unknown type name 'fpos_t'
int      fgetpos(FILE * __restrict, fpos_t * __restrict) __RENAME(__fgetpos50);
                                    ^
/usr/include/stdio.h:291:33:/usr/include/stdio.h :error292: :unknown type name 'fpos_t'
28: error: unknown type name 'fpos_t'
int      fgetpos(FILE * __restrict, fpos_t * __restrict) __RENAME(__fgetpos50);
                                    ^
int      fsetpos(FILE *, const fpos_t *) __RENAME(__fsetpos50);
                               ^
/usr/include/stdio.h:292:28: error: unknown type name 'fpos_t'
int      fsetpos(FILE *, const fpos_t *) __RENAME(__fsetpos50);
                               ^
In file included from zm_camera.cpp:20:
In file included from ./zm.h:27:
In file included from ./zm_config.h:26:
In file included from /usr/include/c++/string:506:
In file included from /usr/include/c++/string_view:175:
In file included from /usr/include/c++/__string:57:
In file included from /usr/include/c++/algorithm:643:
In file included from /usr/include/c++/memory:668:
In file included from /usr/include/c++/typeinfo:60:
In file included from /usr/include/c++/exception:83:
../version:1:1: error: expected unqualified-id
1.29.0
^
In file included from zm_camera.cpp:20:
In file included from ./zm.h:27:
In file included from ./zm_config.h:26:
In file included from /usr/include/c++/string:506:
In file included from /usr/include/c++/string_view:175:
In file included from /usr/include/c++/__string:57:
In file included from /usr/include/c++/algorithm:643:
In file included from /usr/include/c++/memory:671:
In file included from /usr/include/c++/new:93:
../version:1:1: error: expected unqualified-id
1.29.0
^
In file included from zm_curl_camera.cpp:20:
In file included from ./zm.h:27:
In file included from ./zm_config.h:26:
In file included from /usr/include/c++/string:506:
In file included from /usr/include/c++/string_view:175:
In file included from /usr/include/c++/__string:57:
In file included from /usr/include/c++/algorithm:642:
In file included from /usr/include/c++/utility:205:
../version:1:1: error: expected unqualified-id
1.29.0
^
In file included from zm_curl_camera.cpp:20:
In file included from ./zm.h:27:
In file included from ./zm_config.h:26:
In file included from /usr/include/c++/string:506:
In file included from /usr/include/c++/string_view:175:
In file included from /usr/include/c++/__string:57:
In file included from /usr/include/c++/algorithm:642:
In file included from /usr/include/c++/utility:206:
In file included from /usr/include/c++/__debug:14:
In file included from /usr/include/c++/iosfwd:95:
In file included from /usr/include/c++/wchar.h:118:
In file included from /usr/include/wchar.h:67:
In file included from /usr/include/c++/stdio.h:107:
/usr/include/stdio.h:77:3: error: C++ requires a type specifier for all declarations
} fpos_t;
  ^
In file included from zm_camera.cpp:20:
In file included from ./zm.h:27:
In file included from ./zm_config.h:26:
In file included from /usr/include/c++/string:506:
In file included from /usr/include/c++/string_view:175:
In file included from /usr/include/c++/__string:57:
In file included from /usr/include/c++/algorithm:643:
In file included from /usr/include/c++/memory:673:
In file included from /usr/include/c++/limits:121:
../version:1:1: error: expected unqualified-id
1.29.0
^
In file included from zm_config.cpp:20:
In file included from ./zm.h:27:
In file included from ./zm_config.h:26:
In file included from /usr/include/c++/string:506:
In file included from /usr/include/c++/string_view:175:
In file included from /usr/include/c++/__string:57:
In file included from In file included from zm_box.cpp/usr/include/c++/algorithm::20642:
:
In file included from In file included from /usr/include/c++/utility./zm.h::20527:
:
../versionIn file included from :./zm_config.h1::126::
 In file included from error/usr/include/c++/string: :506expected unqualified-id
:
In file included from /usr/include/c++/string_view:1.29.0
^175
:
In file included from /usr/include/c++/__string:57:
In file included from /usr/include/c++/algorithm:642:
In file included from /usr/include/c++/utility:205:
../version:1:1: error: expected unqualified-id
1.29.0
^
/usr/include/stdio.h:291:33: error: unknown type name 'fpos_t'
int      fgetpos(FILE * __restrict, fpos_t * __restrict) __RENAME(__fgetpos50);
                                    ^
/usr/include/stdio.h:292:28: error: unknown type name 'fpos_t'
int      fsetpos(FILE *, const fpos_t *) __RENAME(__fsetpos50);
                               ^
In file included from zm_config.cpp:20:
In file included from ./zm.h:27:
In file included from ./zm_config.h:26:
In file included from In file included from zm_box.cpp/usr/include/c++/string::20506:
:
In file included from In file included from ./zm.h/usr/include/c++/string_view::27175:
:
In file included from In file included from ./zm_config.h/usr/include/c++/__string::26:
57In file included from :
/usr/include/c++/stringIn file included from :506/usr/include/c++/algorithm:
:In file included from 642/usr/include/c++/string_view:
:In file included from 175/usr/include/c++/utility:
:206In file included from :
/usr/include/c++/__stringIn file included from :/usr/include/c++/__debug57:
:In file included from 14/usr/include/c++/algorithm::
642In file included from :
/usr/include/c++/iosfwdIn file included from :/usr/include/c++/utility95::
206In file included from /usr/include/c++/wchar.h:
:In file included from 118/usr/include/c++/__debug:14:
In file included from :
/usr/include/c++/iosfwd:95:
In file included from In file included from /usr/include/c++/wchar.h/usr/include/wchar.h::11867:
:
In file included from /usr/include/wchar.h:In file included from 67/usr/include/c++/stdio.h:
In file included from /usr/include/c++/stdio.h:107:
:/usr/include/stdio.h107::
77:/usr/include/stdio.h3::77 :error3: :C++ requires a type specifier for all declarations error
: C++ requires a type specifier for all declarations} fpos_t;

  ^} fpos_t;

  ^
/usr/include/stdio.h:291:33: error: unknown type name 'fpos_t'
int      fgetpos(FILE * __restrict, fpos_t * __restrict) __RENAME(__fgetpos50);
                                    ^
/usr/include/stdio.h:291:33: error: unknown type name 'fpos_t'
int      fgetpos(FILE * __restrict, fpos_t * __restrict) __RENAME(__fgetpos50);
                                    ^
/usr/include/stdio.h:292:28: error: unknown type name 'fpos_t'
int      fsetpos(FILE *, const fpos_t *) __RENAME(__fsetpos50);
                               ^
/usr/include/stdio.h:292:28: error: unknown type name 'fpos_t'
int      fsetpos(FILE *, const fpos_t *) __RENAME(__fsetpos50);
                               ^
In file included from zm_buffer.cpp:23:
In file included from ./zm.h:27:
In file included from ./zm_config.h:26:
In file included from /usr/include/c++/string:506:
In file included from /usr/include/c++/string_view:175:
In file included from /usr/include/c++/__string:57:
In file included from /usr/include/c++/algorithm:643:
In file included from /usr/include/c++/memory:668:
In file included from /usr/include/c++/typeinfo:60:
In file included from /usr/include/c++/exception:83:
../version:1:1: error: expected unqualified-id
1.29.0
^
In file included from zm_camera.cpp:20:
In file included from ./zm.h:27:
In file included from ./zm_config.h:26:
In file included from /usr/include/c++/string:506:
In file included from /usr/include/c++/string_view:175:
In file included from /usr/include/c++/__string:57:
In file included from /usr/include/c++/algorithm:643:
In file included from /usr/include/c++/memory:674:
In file included from /usr/include/c++/iterator:425:
../version:1:1: error: expected unqualified-id
1.29.0
^
In file included from zm_coord.cpp:20:
In file included from ./zm.h:27:
In file included from ./zm_config.h:26:
In file included from /usr/include/c++/string:506:
In file included from /usr/include/c++/string_view:175:
In file included from /usr/include/c++/__string:57:
In file included from /usr/include/c++/algorithm:643:
In file included from /usr/include/c++/memory:668:
In file included from /usr/include/c++/typeinfo:60:
In file included from /usr/include/c++/exception:83:
../version:1:1: error: expected unqualified-id
1.29.0
^
In file included from zm_buffer.cpp:23:
In file included from ./zm.h:27:
In file included from ./zm_config.h:26:
In file included from /usr/include/c++/string:506:
In file included from /usr/include/c++/string_view:175:
In file included from /usr/include/c++/__string:57:
In file included from /usr/include/c++/algorithm:643:
In file included from /usr/include/c++/memory:671:
In file included from /usr/include/c++/new:93:
../version:1:1: error: expected unqualified-id
1.29.0
^
In file included from zm_coord.cpp:20:
In file included from ./zm.h:27:
In file included from ./zm_config.h:26:
In file included from /usr/include/c++/string:506:
In file included from /usr/include/c++/string_view:175:
In file included from /usr/include/c++/__string:57:
In file included from /usr/include/c++/algorithm:643:
In file included from /usr/include/c++/memory:671:
In file included from /usr/include/c++/new:93:
../version:1:1: error: expected unqualified-id
1.29.0
^
In file included from zm_buffer.cpp:23:
In file included from ./zm.h:27:
In file included from ./zm_config.h:26:
In file included from /usr/include/c++/string:506:
In file included from /usr/include/c++/string_view:175:
In file included from /usr/include/c++/__string:57:
In file included from /usr/include/c++/algorithm:643:
In file included from /usr/include/c++/memory:673:
In file included from /usr/include/c++/limits:121:
../version:1:1: error: expected unqualified-id
1.29.0
^
In file included from zm_coord.cpp:20:
In file included from ./zm.h:27:
In file included from ./zm_config.h:26:
In file included from /usr/include/c++/string:506:
In file included from /usr/include/c++/string_view:175:
In file included from /usr/include/c++/__string:57:
In file included from /usr/include/c++/algorithm:643:
In file included from /usr/include/c++/memory:673:
In file included from /usr/include/c++/limits:121:
../version:1:1: error: expected unqualified-id
1.29.0
^
In file included from zm_comms.cpp:20:
In file included from ./zm_comms.h:23:
In file included from ./zm_exception.h:23:
In file included from ./zm.h:27:
In file included from ./zm_config.h:26:
In file included from /usr/include/c++/string:506:
In file included from /usr/include/c++/string_view:175:
In file included from /usr/include/c++/__string:57:
In file included from In file included from zm_camera.cpp/usr/include/c++/algorithm::20643:
:
In file included from In file included from ./zm.h/usr/include/c++/memory::27668:
:
In file included from ./zm_config.h:26In file included from :
In file included from /usr/include/c++/typeinfo/usr/include/c++/string::60506:
:
In file included from In file included from /usr/include/c++/string_view/usr/include/c++/exception::17583:
:
In file included from ../version/usr/include/c++/__string::157:
In file included from :/usr/include/c++/algorithm1::643:
 In file included from error/usr/include/c++/memory:677: :
In file included from expected unqualified-id/usr/include/c++/tuple
:154:
../version:1:1:1.29.0 
error^: 
expected unqualified-id
1.29.0
^
In file included from zm_curl_camera.cpp:20:
In file included from ./zm.h:27:
In file included from ./zm_config.h:26:
In file included from /usr/include/c++/string:506:
In file included from /usr/include/c++/string_view:175:
In file included from /usr/include/c++/__string:57:
In file included from /usr/include/c++/algorithm:643:
In file included from /usr/include/c++/memory:668:
In file included from /usr/include/c++/typeinfo:60:
In file included from /usr/include/c++/exception:83:
../version:1:1: error: expected unqualified-id
1.29.0
^
In file included from zm_comms.cpp:20:
In file included from ./zm_comms.h:23:
In file included from ./zm_exception.h:23:
In file included from ./zm.h:27:
In file included from ./zm_config.h:26:
In file included from /usr/include/c++/string:506:
In file included from /usr/include/c++/string_view:175:
In file included from /usr/include/c++/__string:57:
In file included from /usr/include/c++/algorithm:643:
In file included from /usr/include/c++/memory:671:
In file included from /usr/include/c++/new:93:
../version:1:1: error: expected unqualified-id
1.29.0
^
In file included from zmc.cpp:70:
In file included from ./zm.h:27:
In file included from ./zm_config.h:26:
In file included from /usr/include/c++/string:506:
In file included from /usr/include/c++/string_view:175:
In file included from /usr/include/c++/__string:57:
In file included from /usr/include/c++/algorithm:643:
In file included from /usr/include/c++/memory:668:
In file included from /usr/include/c++/typeinfo:60:
In file included from /usr/include/c++/exception:83:
../version:1:1: error: expected unqualified-id
1.29.0
^
In file included from zm_comms.cpp:20:
In file included from ./zm_comms.h:23:
In file included from ./zm_exception.h:23:
In file included from ./zm.h:27:
In file included from ./zm_config.h:26:
In file included from /usr/include/c++/string:506:
In file included from /usr/include/c++/string_view:175:
In file included from /usr/include/c++/__string:57:
In file included from /usr/include/c++/algorithm:643:
In file included from /usr/include/c++/memory:673:
In file included from /usr/include/c++/limits:121:
../version:1:1: error: expected unqualified-id
1.29.0
^
In file included from zm_coord.cpp:20:
In file included from ./zm.h:27:
In file included from ./zm_config.h:26:
In file included from /usr/include/c++/string:506:
In file included from /usr/include/c++/string_view:175:
In file included from /usr/include/c++/__string:57:
In file included from /usr/include/c++/algorithm:643:
In file included from /usr/include/c++/memory:674:
In file included from /usr/include/c++/iterator:425:
../version:1:1: error: expected unqualified-id
1.29.0
^
In file included from zm_curl_camera.cpp:20:
In file included from ./zm.h:27:
In file included from ./zm_config.h:26:
In file included from /usr/include/c++/string:506:
In file included from /usr/include/c++/string_view:175:
In file included from /usr/include/c++/__string:57:
In file included from /usr/include/c++/algorithm:643:
In file included from /usr/include/c++/memory:671:
In file included from /usr/include/c++/new:93:
../version:1:1: error: expected unqualified-id
1.29.0
^
In file included from zm_curl_camera.cpp:20:
In file included from ./zm.h:27:
In file included from ./zm_config.h:26:
In file included from /usr/include/c++/string:506:
In file included from /usr/include/c++/string_view:175:
In file included from /usr/include/c++/__string:57:
In file included from /usr/include/c++/algorithm:643:
In file included from /usr/include/c++/memory:673:
In file included from /usr/include/c++/limits:121:
../version:1:1: error: expected unqualified-id
1.29.0
^
In file included from zmc.cpp:70:
In file included from ./zm.h:27:
In file included from ./zm_config.h:26:
In file included from /usr/include/c++/string:506:
In file included from /usr/include/c++/string_view:175:
In file included from /usr/include/c++/__string:57:
In file included from /usr/include/c++/algorithm:643:
In file included from /usr/include/c++/memory:671:
In file included from /usr/include/c++/new:93:
../version:1:1: error: expected unqualified-id
1.29.0
^
In file included from In file included from zm_box.cppzm_config.cpp::2020:
:
In file included from In file included from ./zm.h./zm.h::2727:
:
In file included from In file included from ./zm_config.h./zm_config.h::2626:
In file included from :
/usr/include/c++/stringIn file included from :/usr/include/c++/string506::
506In file included from :
In file included from /usr/include/c++/string_view/usr/include/c++/string_view:175::
175:
In file included from In file included from /usr/include/c++/__string:/usr/include/c++/__string57::
57In file included from :
In file included from /usr/include/c++/algorithm:/usr/include/c++/algorithm:643643:
:
In file included from In file included from /usr/include/c++/memory/usr/include/c++/memory::668668:
:
In file included from In file included from /usr/include/c++/typeinfo/usr/include/c++/typeinfo::6060:
:
In file included from In file included from /usr/include/c++/exception/usr/include/c++/exception::8383:
:
../version../version::11::11::  errorerror: : expected unqualified-idexpected unqualified-id

1.29.0
1.29.0^

^
In file included from zm_buffer.cpp:23:
In file included from ./zm.h:27:
In file included from ./zm_config.h:26:
In file included from /usr/include/c++/string:506:
In file included from /usr/include/c++/string_view:175:
In file included from /usr/include/c++/__string:57:
In file included from /usr/include/c++/algorithm:643:
In file included from /usr/include/c++/memory:674:
In file included from /usr/include/c++/iterator:425:
../version:1:1: error: expected unqualified-id
1.29.0
^
In file included from zmc.cpp:70:
In file included from ./zm.h:27:
In file included from ./zm_config.h:26:
In file included from /usr/include/c++/string:506:
In file included from /usr/include/c++/string_view:175:
In file included from /usr/include/c++/__string:57:
In file included from /usr/include/c++/algorithm:643:
In file included from /usr/include/c++/memory:673:
In file included from /usr/include/c++/limits:121:
../version:1:1: error: expected unqualified-id
1.29.0
^
In file included from zm_coord.cpp:20:
In file included from ./zm.h:27:
In file included from ./zm_config.h:26:
In file included from /usr/include/c++/string:506:
In file included from /usr/include/c++/string_view:175:
In file included from /usr/include/c++/__string:57:
In file included from /usr/include/c++/algorithm:643:
In file included from /usr/include/c++/memory:677:
In file included from /usr/include/c++/tuple:154:
../version:1:1: error: expected unqualified-id
1.29.0
^
In file included from In file included from zm_box.cppzm_config.cpp::2020:
In file included from ./zm.h:
:In file included from 27./zm.h:
In file included from :./zm_config.h27::
26In file included from :
./zm_config.hIn file included from :/usr/include/c++/string26::
506In file included from :
In file included from /usr/include/c++/string/usr/include/c++/string_view::175506:
In file included from :
/usr/include/c++/__string:57In file included from :
/usr/include/c++/string_viewIn file included from :/usr/include/c++/algorithm175::
643In file included from :
/usr/include/c++/__stringIn file included from :/usr/include/c++/memory57::
671In file included from :
In file included from /usr/include/c++/new/usr/include/c++/algorithm::93643:
:
../version:In file included from 1/usr/include/c++/memory::1671: :
errorIn file included from : /usr/include/c++/newexpected unqualified-id:
93:
../version1.29.0:
1^:
1: error: expected unqualified-id
1.29.0
^
In file included from zm_box.cpp:20:
In file included from ./zm.h:27:
In file included from ./zm_config.h:26:
In file included from /usr/include/c++/string:506:
In file included from /usr/include/c++/string_view:175:
In file included from /usr/include/c++/__string:57:
In file included from /usr/include/c++/algorithm:643:
In file included from /usr/include/c++/memory:673:
In file included from /usr/include/c++/limits:121:
../version:1:1: error: expected unqualified-id
1.29.0
^
In file included from zm_config.cpp:20:
In file included from ./zm.h:27:
In file included from ./zm_config.h:26:
In file included from /usr/include/c++/string:506:
In file included from /usr/include/c++/string_view:175:
In file included from /usr/include/c++/__string:57:
In file included from /usr/include/c++/algorithm:643:
In file included from /usr/include/c++/memory:673:
In file included from /usr/include/c++/limits:121:
../version:1:1: error: expected unqualified-id
1.29.0
^
In file included from zm_camera.cpp:20:
In file included from ./zm.h:27:
In file included from ./zm_config.h:26:
In file included from /usr/include/c++/string:506:
In file included from /usr/include/c++/string_view:175:
In file included from /usr/include/c++/__string:57:
In file included from /usr/include/c++/algorithm:643:
In file included from /usr/include/c++/memory:681:
In file included from /usr/include/c++/atomic:550:
In file included from /usr/include/c++/__threading_support:14:
In file included from /usr/include/c++/chrono:831:
../version:1:1: error: expected unqualified-id
1.29.0
^
In file included from zm_comms.cpp:20:
In file included from ./zm_comms.h:23:
In file included from ./zm_exception.h:23:
In file included from ./zm.h:27:
In file included from ./zm_config.h:26:
In file included from /usr/include/c++/string:506:
In file included from /usr/include/c++/string_view:175:
In file included from /usr/include/c++/__string:57:
In file included from /usr/include/c++/algorithm:643:
In file included from /usr/include/c++/memory:674:
In file included from /usr/include/c++/iterator:425:
../version:1:1: error: expected unqualified-id
1.29.0
^
In file included from zm_curl_camera.cpp:20:
In file included from ./zm.h:27:
In file included from ./zm_config.h:26:
In file included from /usr/include/c++/string:506:
In file included from /usr/include/c++/string_view:175:
In file included from /usr/include/c++/__string:57:
In file included from /usr/include/c++/algorithm:643:
In file included from /usr/include/c++/memory:674:
In file included from /usr/include/c++/iterator:425:
../version:1:1: error: expected unqualified-id
1.29.0
^
In file included from zm_buffer.cpp:23:
In file included from ./zm.h:27:
In file included from ./zm_config.h:26:
In file included from /usr/include/c++/string:506:
In file included from /usr/include/c++/string_view:175:
In file included from /usr/include/c++/__string:57:
In file included from /usr/include/c++/algorithm:643:
In file included from /usr/include/c++/memory:677:
In file included from /usr/include/c++/tuple:154:
../version:1:1: error: expected unqualified-id
1.29.0
^
In file included from zm_box.cpp:20:
In file included from ./zm.h:27:
In file included from ./zm_config.h:26:
In file included from /usr/include/c++/string:506:
In file included from /usr/include/c++/string_view:175:
In file included from /usr/include/c++/__string:57:
In file included from /usr/include/c++/algorithm:643:
In file included from /usr/include/c++/memory:674:
In file included from /usr/include/c++/iterator:425:
../version:1:1: error: expected unqualified-id
1.29.0
^
In file included from zmc.cpp:70:
In file included from ./zm.h:27:
In file included from ./zm_config.h:26:
In file included from /usr/include/c++/string:506:
In file included from /usr/include/c++/string_view:175:
In file included from /usr/include/c++/__string:57:
In file included from /usr/include/c++/algorithm:643:
In file included from /usr/include/c++/memory:674:
In file included from /usr/include/c++/iterator:425:
../version:1:1: error: expected unqualified-id
1.29.0
^
In file included from zm_config.cpp:20:
In file included from ./zm.h:27:
In file included from ./zm_config.h:26:
In file included from /usr/include/c++/string:506:
In file included from /usr/include/c++/string_view:175:
In file included from /usr/include/c++/__string:57:
In file included from /usr/include/c++/algorithm:643:
In file included from /usr/include/c++/memory:674:
In file included from /usr/include/c++/iterator:425:
../version:1:1: error: expected unqualified-id
1.29.0
^
In file included from zm_comms.cpp:20:
In file included from ./zm_comms.h:23:
In file included from ./zm_exception.h:23:
In file included from ./zm.h:27:
In file included from ./zm_config.h:26:
In file included from /usr/include/c++/string:506:
In file included from /usr/include/c++/string_view:175:
In file included from /usr/include/c++/__string:57:
In file included from /usr/include/c++/algorithm:643:
In file included from /usr/include/c++/memory:677:
In file included from /usr/include/c++/tuple:154:
../version:1:1: error: expected unqualified-id
1.29.0
^
In file included from zm_coord.cpp:20:
In file included from ./zm.h:27:
In file included from ./zm_config.h:26:
In file included from /usr/include/c++/string:506:
In file included from /usr/include/c++/string_view:175:
In file included from /usr/include/c++/__string:57:
In file included from /usr/include/c++/algorithm:643:
In file included from /usr/include/c++/memory:681:
In file included from /usr/include/c++/atomic:550:
In file included from /usr/include/c++/__threading_support:14:
In file included from /usr/include/c++/chrono:831:
../version:1:1: error: expected unqualified-id
1.29.0
^
In file included from zm_curl_camera.cpp:20:
In file included from ./zm.h:27:
In file included from ./zm_config.h:26:
In file included from /usr/include/c++/string:506:
In file included from /usr/include/c++/string_view:175:
In file included from /usr/include/c++/__string:57:
In file included from /usr/include/c++/algorithm:643:
In file included from /usr/include/c++/memory:677:
In file included from /usr/include/c++/tuple:154:
../version:1:1: error: expected unqualified-id
1.29.0
^
In file included from zm_box.cpp:20:
In file included from ./zm.h:27:
In file included from ./zm_config.h:26:
In file included from /usr/include/c++/string:506:
In file included from /usr/include/c++/string_view:175:
In file included from /usr/include/c++/__string:57:
In file included from /usr/include/c++/algorithm:643:
In file included from /usr/include/c++/memory:677:
In file included from /usr/include/c++/tuple:154:
../version:1:1: error: expected unqualified-id
1.29.0
^
In file included from zmc.cpp:70:
In file included from ./zm.h:27:
In file included from ./zm_config.h:26:
In file included from /usr/include/c++/string:506:
In file included from /usr/include/c++/string_view:175:
In file included from /usr/include/c++/__string:57:
In file included from /usr/include/c++/algorithm:643:
In file included from /usr/include/c++/memory:677:
In file included from /usr/include/c++/tuple:154:
../version:1:1: error: expected unqualified-id
1.29.0
^
In file included from zm_config.cpp:20:
In file included from ./zm.h:27:
In file included from ./zm_config.h:26:
In file included from /usr/include/c++/string:506:
In file included from /usr/include/c++/string_view:175:
In file included from /usr/include/c++/__string:57:
In file included from /usr/include/c++/algorithm:643:
In file included from /usr/include/c++/memory:677:
In file included from /usr/include/c++/tuple:154:
../version:1:1: error: expected unqualified-id
1.29.0
^
In file included from zm_camera.cpp:20:
In file included from ./zm.h:27:
In file included from ./zm_config.h:26:
In file included from /usr/include/c++/string:506:
In file included from /usr/include/c++/string_view:175:
In file included from /usr/include/c++/__string:57:
In file included from /usr/include/c++/algorithm:643:
In file included from /usr/include/c++/memory:681:
In file included from /usr/include/c++/atomic:555:
../version:1:1: error: expected unqualified-id
1.29.0
^
In file included from zm_buffer.cpp:23:
In file included from ./zm.h:27:
In file included from ./zm_config.h:26:
In file included from /usr/include/c++/string:506:
In file included from /usr/include/c++/string_view:175:
In file included from /usr/include/c++/__string:57:
In file included from /usr/include/c++/algorithm:643:
In file included from /usr/include/c++/memory:681:
In file included from /usr/include/c++/atomic:550:
In file included from /usr/include/c++/__threading_support:14:
In file included from /usr/include/c++/chrono:831:
../version:1:1: error: expected unqualified-id
1.29.0
^
In file included from zm_comms.cpp:20:
In file included from ./zm_comms.h:23:
In file included from ./zm_exception.h:23:
In file included from ./zm.h:27:
In file included from ./zm_config.h:26:
In file included from /usr/include/c++/string:506:
In file included from /usr/include/c++/string_view:175:
In file included from /usr/include/c++/__string:57:
In file included from /usr/include/c++/algorithm:643:
In file included from /usr/include/c++/memory:681:
In file included from /usr/include/c++/atomic:550:
In file included from /usr/include/c++/__threading_support:14:
In file included from /usr/include/c++/chrono:831:
../version:1:1: error: expected unqualified-id
1.29.0
^
In file included from zm_camera.cpp:20:
In file included from ./zm.h:27:
In file included from ./zm_config.h:26:
In file included from /usr/include/c++/string:506:
In file included from /usr/include/c++/string_view:175:
In file included from /usr/include/c++/__string:57:
In file included from /usr/include/c++/algorithm:643:
In file included from /usr/include/c++/memory:683:
../version:1:1: error: expected unqualified-id
1.29.0
^
In file included from zm_curl_camera.cpp:20:
In file included from ./zm.h:27:
In file included from ./zm_config.h:26:
In file included from /usr/include/c++/string:506:
In file included from /usr/include/c++/string_view:175:
In file included from /usr/include/c++/__string:57:
In file included from /usr/include/c++/algorithm:643:
In file included from /usr/include/c++/memory:681:
In file included from /usr/include/c++/atomic:550:
In file included from /usr/include/c++/__threading_support:14:
In file included from /usr/include/c++/chrono:831:
../version:1:1: error: expected unqualified-id
1.29.0
^
In file included from zm_config.cpp:20:
In file included from ./zm.h:27:
In file included from ./zm_config.h:26:
In file included from /usr/include/c++/string:506:
In file included from /usr/include/c++/string_view:175:
In file included from /usr/include/c++/__string:57:
In file included from /usr/include/c++/algorithm:643:
In file included from /usr/include/c++/memory:681:
In file included from /usr/include/c++/atomic:550:
In file included from /usr/include/c++/__threading_support:14:
In file included from /usr/include/c++/chrono:831:
../version:1:1: error: expected unqualified-id
1.29.0
^
In file included from zm_box.cpp:20:
In file included from ./zm.h:27:
In file included from ./zm_config.h:26:
In file included from /usr/include/c++/string:506:
In file included from /usr/include/c++/string_view:175:
In file included from /usr/include/c++/__string:57:
In file included from /usr/include/c++/algorithm:643:
In file included from /usr/include/c++/memory:681:
In file included from /usr/include/c++/atomic:550:
In file included from /usr/include/c++/__threading_support:14:
In file included from /usr/include/c++/chrono:831:
../version:1:1: error: expected unqualified-id
1.29.0
^
In file included from zm_coord.cpp:20:
In file included from ./zm.h:27:
In file included from ./zm_config.h:26:
In file included from /usr/include/c++/string:506:
In file included from /usr/include/c++/string_view:175:
In file included from /usr/include/c++/__string:57:
In file included from /usr/include/c++/algorithm:643:
In file included from /usr/include/c++/memory:681:
In file included from /usr/include/c++/atomic:555:
../version:1:1: error: expected unqualified-id
1.29.0
^
In file included from zmc.cpp:70:
In file included from ./zm.h:27:
In file included from ./zm_config.h:26:
In file included from /usr/include/c++/string:506:
In file included from /usr/include/c++/string_view:175:
In file included from /usr/include/c++/__string:57:
In file included from /usr/include/c++/algorithm:643:
In file included from /usr/include/c++/memory:681:
In file included from /usr/include/c++/atomic:550:
In file included from /usr/include/c++/__threading_support:14:
In file included from /usr/include/c++/chrono:831:
../version:1:1: error: expected unqualified-id
1.29.0
^
In file included from zm_coord.cpp:20:
In file included from ./zm.h:27:
In file included from ./zm_config.h:26:
In file included from /usr/include/c++/string:506:
In file included from /usr/include/c++/string_view:175:
In file included from /usr/include/c++/__string:57:
In file included from /usr/include/c++/algorithm:643:
In file included from /usr/include/c++/memory:683:
../version:1:1: error: expected unqualified-id
1.29.0
^
In file included from zm_camera.cpp:20:
In file included from ./zm.h:27:
In file included from ./zm_config.h:26:
In file included from /usr/include/c++/string:506:
In file included from /usr/include/c++/string_view:175:
In file included from /usr/include/c++/__string:57:
In file included from /usr/include/c++/algorithm:644:
In file included from /usr/include/c++/functional:507:
../version:1:1: error: expected unqualified-id
1.29.0
^
In file included from zm_buffer.cpp:23:
In file included from ./zm.h:27:
In file included from ./zm_config.h:26:
In file included from /usr/include/c++/string:506:
In file included from /usr/include/c++/string_view:175:
In file included from /usr/include/c++/__string:57:
In file included from /usr/include/c++/algorithm:643:
In file included from /usr/include/c++/memory:681:
In file included from /usr/include/c++/atomic:555:
../version:1:1: error: expected unqualified-id
1.29.0
^
In file included from zm_camera.cpp:20:
In file included from ./zm.h:27:
In file included from ./zm_config.h:26:
In file included from /usr/include/c++/string:506:
In file included from /usr/include/c++/string_view:175:
In file included from /usr/include/c++/__string:57:
In file included from /usr/include/c++/algorithm:647:
In file included from /usr/include/c++/bit:59:
../version:1:1: error: expected unqualified-id
1.29.0
^
In file included from zm_camera.cpp:20:
In file included from ./zm.h:27:
In file included from ./zm_config.h:26:
In file included from /usr/include/c++/string:506:
In file included from /usr/include/c++/string_view:175:
In file included from /usr/include/c++/__string:57:
In file included from /usr/include/c++/algorithm:648:
../version:1:1: error: expected unqualified-id
1.29.0
^
In file included from zm_curl_camera.cpp:20:
In file included from ./zm.h:27:
In file included from ./zm_config.h:26:
In file included from /usr/include/c++/string:506:
In file included from /usr/include/c++/string_view:175:
In file included from /usr/include/c++/__string:57:
In file included from /usr/include/c++/algorithm:643:
In file included from /usr/include/c++/memory:681:
In file included from /usr/include/c++/atomic:555:
../version:1:1: error: expected unqualified-id
1.29.0
^
In file included from zm_comms.cpp:20:
In file included from ./zm_comms.h:23:
In file included from ./zm_exception.h:23:
In file included from ./zm.h:27:
In file included from ./zm_config.h:26:
In file included from /usr/include/c++/string:506:
In file included from /usr/include/c++/string_view:175:
In file included from /usr/include/c++/__string:57:
In file included from /usr/include/c++/algorithm:643:
In file included from /usr/include/c++/memory:681:
In file included from /usr/include/c++/atomic:555:
../version:1:1: error: expected unqualified-id
1.29.0
^
In file included from zm_buffer.cpp:23:
In file included from ./zm.h:27:
In file included from ./zm_config.h:26:
In file included from /usr/include/c++/string:506:
In file included from /usr/include/c++/string_view:175:
In file included from /usr/include/c++/__string:57:
In file included from /usr/include/c++/algorithm:643:
In file included from /usr/include/c++/memory:683:
../version:1:1: error: expected unqualified-id
1.29.0
^
In file included from zm_config.cpp:20:
In file included from ./zm.h:27:
In file included from ./zm_config.h:26:
In file included from /usr/include/c++/string:506:
In file included from /usr/include/c++/string_view:175:
In file included from /usr/include/c++/__string:57:
In file included from /usr/include/c++/algorithm:643:
In file included from /usr/include/c++/memory:681:
In file included from /usr/include/c++/atomic:555:
../version:1:1: error: expected unqualified-id
1.29.0
^
In file included from zm_box.cpp:20:
In file included from ./zm.h:27:
In file included from ./zm_config.h:26:
In file included from /usr/include/c++/string:506:
In file included from /usr/include/c++/string_view:175:
In file included from /usr/include/c++/__string:57:
In file included from /usr/include/c++/algorithm:643:
In file included from /usr/include/c++/memory:681:
In file included from /usr/include/c++/atomic:555:
../version:1:1: error: expected unqualified-id
1.29.0
^
In file included from zm_coord.cpp:20:
In file included from ./zm.h:27:
In file included from ./zm_config.h:26:
In file included from /usr/include/c++/string:506:
In file included from /usr/include/c++/string_view:175:
In file included from /usr/include/c++/__string:57:
In file included from /usr/include/c++/algorithm:644:
In file included from /usr/include/c++/functional:507:
../version:1:1: error: expected unqualified-id
1.29.0
^
In file included from zmc.cpp:70:
In file included from ./zm.h:27:
In file included from ./zm_config.h:26:
In file included from /usr/include/c++/string:506:
In file included from /usr/include/c++/string_view:175:
In file included from /usr/include/c++/__string:57:
In file included from /usr/include/c++/algorithm:643:
In file included from /usr/include/c++/memory:681:
In file included from /usr/include/c++/atomic:555:
../version:1:1: error: expected unqualified-id
1.29.0
^
In file included from zm_curl_camera.cpp:20:
In file included from ./zm.h:27:
In file included from ./zm_config.h:26:
In file included from /usr/include/c++/string:506:
In file included from /usr/include/c++/string_view:175:
In file included from /usr/include/c++/__string:57:
In file included from /usr/include/c++/algorithm:643:
In file included from /usr/include/c++/memory:683:
../version:1:1: error: expected unqualified-id
1.29.0
^
In file included from zm_comms.cpp:20:
In file included from ./zm_comms.h:23:
In file included from ./zm_exception.h:23:
In file included from ./zm.h:27:
In file included from ./zm_config.h:26:
In file included from /usr/include/c++/string:506:
In file included from /usr/include/c++/string_view:175:
In file included from /usr/include/c++/__string:57:
In file included from /usr/include/c++/algorithm:643:
In file included from /usr/include/c++/memory:683:
../version:1:1: error: expected unqualified-id
1.29.0
^
In file included from zm_box.cpp:20:
In file included from ./zm.h:27:
In file included from ./zm_config.h:26:
In file included from /usr/include/c++/string:506:
In file included from /usr/include/c++/string_view:175:
In file included from /usr/include/c++/__string:57:
In file included from /usr/include/c++/algorithm:643:
In file included from /usr/include/c++/memory:683:
../version:1:1: error: expected unqualified-id
1.29.0
^
In file included from zm_config.cpp:20:
In file included from ./zm.h:27:
In file included from ./zm_config.h:26:
In file included from /usr/include/c++/string:506:
In file included from /usr/include/c++/string_view:175:
In file included from /usr/include/c++/__string:57:
In file included from /usr/include/c++/algorithm:643:
In file included from /usr/include/c++/memory:683:
../version:1:1: error: expected unqualified-id
1.29.0
^
In file included from zm_camera.cpp:20:
In file included from ./zm.h:27:
In file included from ./zm_config.h:26:
In file included from /usr/include/c++/string:506:
In file included from /usr/include/c++/string_view:181:
../version:1:1: error: expected unqualified-id
1.29.0
^
In file included from zm_coord.cpp:20:
In file included from ./zm.h:27:
In file included from ./zm_config.h:26:
In file included from /usr/include/c++/string:506:
In file included from /usr/include/c++/string_view:175:
In file included from /usr/include/c++/__string:57:
In file included from /usr/include/c++/algorithm:647:
In file included from /usr/include/c++/bit:59:
../version:1:1: error: expected unqualified-id
1.29.0
^
In file included from zmc.cpp:70:
In file included from ./zm.h:27:
In file included from ./zm_config.h:26:
In file included from /usr/include/c++/string:506:
In file included from /usr/include/c++/string_view:175:
In file included from /usr/include/c++/__string:57:
In file included from /usr/include/c++/algorithm:643:
In file included from /usr/include/c++/memory:683:
../version:1:1: error: expected unqualified-id
1.29.0
^
In file included from zm_coord.cpp:20:
In file included from ./zm.h:27:
In file included from ./zm_config.h:26:
In file included from /usr/include/c++/string:506:
In file included from /usr/include/c++/string_view:175:
In file included from /usr/include/c++/__string:57:
In file included from /usr/include/c++/algorithm:648:
../version:1:1: error: expected unqualified-id
1.29.0
^
In file included from zm_buffer.cpp:23:
In file included from ./zm.h:27:
In file included from ./zm_config.hfatal error: :too many errors emitted, stopping now [-ferror-limit=]26
:
In file included from /usr/include/c++/string:506:
In file included from /usr/include/c++/string_view:175:
In file included from /usr/include/c++/__string:57:
In file included from /usr/include/c++/algorithm:644:
In file included from /usr/include/c++/functional:507:
../version:1:1: error: expected unqualified-id
1.29.0
^
In file included from zm_curl_camera.cpp:20:
In file included from ./zm.h:27:
In file included from ./zm_config.h:26:
In file included from /usr/include/c++/string:506:
In file included from /usr/include/c++/string_view:175:
In file included from /usr/include/c++/__string:57:
In file included from /usr/include/c++/algorithm:644:
In file included from /usr/include/c++/functional:507:
../version:1:1: error: expected unqualified-id
1.29.0
^
In file included from zm_buffer.cpp:23:
In file included from ./zm.h:27:
In file included from ./zm_config.h:26:
In file included from /usr/include/c++/string:506:
In file included from /usr/include/c++/string_view:175:
In file included from /usr/include/c++/__string:57:
In file included from /usr/include/c++/algorithm:647:
In file included from /usr/include/c++/bit:59:
../version:1:1: error: expected unqualified-id
1.29.0
^
In file included from zm_buffer.cpp:23:
In file included from ./zm.h:27:
In file included from ./zm_config.h:26:
In file included from /usr/include/c++/string:506:
In file included from /usr/include/c++/string_view:175:
In file included from /usr/include/c++/__string:57:
In file included from /usr/include/c++/algorithm:648:
../version:1:1: error: expected unqualified-id
1.29.0
^
In file included from zm_coord.cpp:20:
In file included from ./zm.h:27:
In file included from ./zm_config.h:26:
In file included from /usr/include/c++/string:506:
In file included from /usr/include/c++/string_view:181:
../version:1:1: error: expected unqualified-id
1.29.0
^
In file included from zm_comms.cpp:20:
In file included from ./zm_comms.h:23:
In file included from ./zm_exception.h:23:
In file included from ./zm.h:27:
In file included from ./zm_config.h:26:
In file included from /usr/include/c++/string:506:
In file included from /usr/include/c++/string_view:175:
In file included from /usr/include/c++/__string:57:
In file included from /usr/include/c++/algorithm:644:
In file included from /usr/include/c++/functional:507:
../version:1:1: error: expected unqualified-id
1.29.0
^
In file included from zm_box.cpp:20:
In file included from ./zm.h:27:
In file included from ./zm_config.h:26:
In file included from /usr/include/c++/string:506:
In file included from /usr/include/c++/string_view:175:
In file included from /usr/include/c++/__string:57:
In file included from /usr/include/c++/algorithm:644:
In file included from /usr/include/c++/functional:507:
../version:1:1: error: expected unqualified-id
1.29.0
^
In file included from zm_config.cpp:20:
In file included from ./zm.h:27:
In file included from ./zm_config.h:26:
In file included from /usr/include/c++/string:506:
In file included from /usr/include/c++/string_view:175:
In file included from /usr/include/c++/__string:57:
In file included from /usr/include/c++/algorithm:644:
In file included from /usr/include/c++/functional:507:
../version:1:1: error: expected unqualified-id
1.29.0
^
fatal error: too many errors emitted, stopping now [-ferror-limit=]
In file included from zmc.cpp:70:
In file included from ./zm.h:27:
In file included from ./zm_config.h:26:
In file included from /usr/include/c++/string:506:
In file included from /usr/include/c++/string_view:175:
In file included from /usr/include/c++/__string:57:
In file included from /usr/include/c++/algorithm:644:
In file included from /usr/include/c++/functional:507:
../version:1:1: error: expected unqualified-id
1.29.0
^
In file included from zm_curl_camera.cpp:20:
In file included from ./zm.h:27:
In file included from ./zm_config.h:26:
In file included from /usr/include/c++/string:506:
In file included from /usr/include/c++/string_view:175:
In file included from /usr/include/c++/__string:57:
In file included from /usr/include/c++/algorithm:647:
In file included from /usr/include/c++/bit:59:
../version:1:1: error: expected unqualified-id
1.29.0
^
In file included from zm_curl_camera.cpp:20:
In file included from ./zm.h:27:
In file included from ./zm_config.h:26:
In file included from /usr/include/c++/string:506:
In file included from /usr/include/c++/string_view:175:
In file included from /usr/include/c++/__string:57:
In file included from /usr/include/c++/algorithm:648:
../version:1:1: error: expected unqualified-id
1.29.0
^
In file included from zm_comms.cpp:20:
In file included from ./zm_comms.h:23:
In file included from ./zm_exception.h:23:
In file included from ./zm.h:27:
In file included from ./zm_config.h:26:
In file included from /usr/include/c++/string:506:
In file included from /usr/include/c++/string_view:175:
In file included from /usr/include/c++/__string:57:
In file included from /usr/include/c++/algorithm:647:
In file included from /usr/include/c++/bit:59:
../version:1:1: error: expected unqualified-id
1.29.0
^In file included from 
zm_buffer.cpp:23:
In file included from ./zm.h:27:
In file included from ./zm_config.h:26:
In file included from /usr/include/c++/string:506:
In file included from /usr/include/c++/string_view:181:
../version:1:1: error: expected unqualified-id
1.29.0
^
In file included from zm_box.cpp:20:
In file included from ./zm.h:27:
In file included from ./zm_config.h:26:
In file included from /usr/include/c++/string:506:
In file included from /usr/include/c++/string_view:175:
In file included from /usr/include/c++/__string:57:
In file included from /usr/include/c++/algorithm:647:
In file included from /usr/include/c++/bit:59:
../version:1:1: error: expected unqualified-id
1.29.0
^
In file included from zm_config.cpp:20:
In file included from ./zm.h:27:
In file included from ./zm_config.h:26:
In file included from /usr/include/c++/string:506:
In file included from /usr/include/c++/string_view:175:
In file included from /usr/include/c++/__string:57:
In file included from /usr/include/c++/algorithm:647:
In file included from /usr/include/c++/bit:59:
../version:1:1: error: expected unqualified-id
1.29.0
^
In file included from zm_comms.cpp:20:
In file included from ./zm_comms.h:23:
In file included from ./zm_exception.h:23:
In file included from ./zm.h:27:
In file included from ./zm_config.h:26:
In file included from /usr/include/c++/string:506:
In file included from /usr/include/c++/string_view:175:
In file included from /usr/include/c++/__string:57:
In file included from /usr/include/c++/algorithm:648:
../version:1:1: error: expected unqualified-id
1.29.0
^
In file included from zm_box.cpp:20:
In file included from ./zm.h:27:
In file included from ./zm_config.h:26:
In file included from /usr/include/c++/string:506:
In file included from /usr/include/c++/string_view:175:
In file included from /usr/include/c++/__string:57:
In file included from /usr/include/c++/algorithm:648:
../version:1:1: error: expected unqualified-id
1.29.0
^
In file included from zm_config.cpp:20:
In file included from ./zm.h:27:
In file included from ./zm_config.h:26:
In file included from /usr/include/c++/string:506:
In file included from /usr/include/c++/string_view:175:
In file included from /usr/include/c++/__string:57:
In file included from /usr/include/c++/algorithm:648:
../version:1:1: error: expected unqualified-id
1.29.0
^
fatal error: too many errors emitted, stopping now [-ferror-limit=]
In file included from zmc.cpp:70:
In file included from ./zm.h:27:
In file included from ./zm_config.h:26:
In file included from /usr/include/c++/string:506:
In file included from /usr/include/c++/string_view:175:
In file included from /usr/include/c++/__string:57:
In file included from /usr/include/c++/algorithm:647:
In file included from /usr/include/c++/bit:59:
../version:1:1: error: expected unqualified-id
1.29.0
^
In file included from zmc.cpp:70:
In file included from ./zm.h:27:
In file included from ./zm_config.h:26:
In file included from /usr/include/c++/string:506:
In file included from /usr/include/c++/string_view:175:
In file included from /usr/include/c++/__string:57:
In file included from /usr/include/c++/algorithm:648:
../version:1:1: error: expected unqualified-id
1.29.0
^
In file included from zm_curl_camera.cpp:20:
In file included from ./zm.h:27:
In file included from ./zm_config.h:26:
In file included from /usr/include/c++/string:506:
In file included from /usr/include/c++/string_view:181:
../version:1:1: error: expected unqualified-id
1.29.0
^
fatal error: too many errors emitted, stopping now [-ferror-limit=]
In file included from zm_comms.cpp:20:
In file included from ./zm_comms.h:23:
In file included from ./zm_exception.h:23:
In file included from ./zm.h:27:
In file included from ./zm_config.h:26:
In file included from /usr/include/c++/string:506:
In file included from /usr/include/c++/string_view:181:
../version:1:1: error: expected unqualified-id
1.29.0
^
In file included from zm_box.cpp:20:
In file included from ./zm.h:27:
In file included from ./zm_config.h:26:
In file included from /usr/include/c++/string:506:
In file included from /usr/include/c++/string_view:181:
../version:1:1: error: expected unqualified-id
1.29.0
^
In file included from zm_config.cpp:20:
In file included from ./zm.h:27:
In file included from ./zm_config.h:26:
In file included from /usr/include/c++/string:506:
In file included from /usr/include/c++/string_view:181:
../version:1:1: error: expected unqualified-id
1.29.0
^
fatal error: too many errors emitted, stopping now [-ferror-limit=]
fatal error: too many errors emitted, stopping now [-ferror-limit=]
fatal error: too many errors emitted, stopping now [-ferror-limit=]
In file included from zmc.cpp:70:
In file included from ./zm.h:27:
In file included from ./zm_config.h:26:
In file included from /usr/include/c++/string:506:
In file included from /usr/include/c++/string_view:181:
../version:1:1: error: expected unqualified-id
1.29.0
^
fatal error: too many errors emitted, stopping now [-ferror-limit=]
20 errors generated.
gmake[2]: *** [Makefile:585: zm_coord.o] Error 1
gmake[2]: *** Waiting for unfinished jobs....
20 errors generated.
20 errors generated.
gmake[2]: *** [Makefile:585: zm_camera.o] Error 1
gmake[2]: *** [Makefile:585: zm_buffer.o] Error 1
20 errors generated.
gmake[2]: *** [Makefile:585: zm_curl_camera.o] Error 1
20 errors generated.
gmake[2]: *** [Makefile:585: zm_box.o] Error 1
20 errors generated.
gmake[2]: *** [Makefile:585: zm_config.o] Error 1
20 errors generated.
gmake[2]: *** [Makefile:585: zm_comms.o] Error 1
20 errors generated.
gmake[2]: *** [Makefile:585: zmc.o] Error 1
gmake[2]: Leaving directory '/data/scratch/security/zoneminder/work/zoneminder-1.29.0/src'
gmake[1]: *** [Makefile:473: all-recursive] Error 1
gmake[1]: Leaving directory '/data/scratch/security/zoneminder/work/zoneminder-1.29.0'
gmake: *** [Makefile:402: all] Error 2
*** Error code 2

Stop.
make[1]: stopped in /data/pkgsrc/security/zoneminder
*** Error code 1

Stop.
make: stopped in /data/pkgsrc/security/zoneminder