=> Bootstrap dependency digest>=20010302: found digest-20190127
===> Skipping vulnerability checks.
WARNING: No /var/db/pkg/pkg-vulnerabilities file found.
WARNING: To fix run: `/usr/sbin/pkg_admin -K /var/db/pkg fetch-pkg-vulnerabilities'.
===> Skipping vulnerability checks.
WARNING: No /var/db/pkg/pkg-vulnerabilities file found.
WARNING: To fix run: `/usr/sbin/pkg_admin -K /var/db/pkg fetch-pkg-vulnerabilities'.
===> Building for snappy-java-1.0.5.4
[WeaverMain] org.xerial.util.opt.OptionParserException: [UNKNOWN_COMMAND] unkown command find
g++ -I/usr/pkg/java/openjdk11/include -Ilib/inc_mac -O2 -fPIC -fvisibility=hidden  -Ilib/include   -Itarget/snappy-1.0.5 -c target/snappy-1.0.5/snappy-sinksource.cc -o target/snappy-1.0.5-NetBSD-amd64/snappy-sinksource.o 
g++ -I/usr/pkg/java/openjdk11/include -Ilib/inc_mac -O2 -fPIC -fvisibility=hidden  -Ilib/include   -Itarget/snappy-1.0.5 -c target/snappy-1.0.5/snappy-stubs-internal.cc -o target/snappy-1.0.5-NetBSD-amd64/snappy-stubs-internal.o 
g++ -I/usr/pkg/java/openjdk11/include -Ilib/inc_mac -O2 -fPIC -fvisibility=hidden  -Ilib/include   -Itarget/snappy-1.0.5 -c target/snappy-1.0.5/snappy.cc -o target/snappy-1.0.5-NetBSD-amd64/snappy.o 
g++ -I/usr/pkg/java/openjdk11/include -Ilib/inc_mac -O2 -fPIC -fvisibility=hidden  -Ilib/include   -Itarget/snappy-1.0.5 -c src/main/java/org/xerial/snappy/SnappyNative.cpp -o target/snappy-1.0.5-NetBSD-amd64/SnappyNative.o
g++ -I/usr/pkg/java/openjdk11/include -Ilib/inc_mac -O2 -fPIC -fvisibility=hidden  -Ilib/include   -Itarget/snappy-1.0.5 -o target/snappy-1.0.5-NetBSD-amd64/libsnappyjava.so target/snappy-1.0.5-NetBSD-amd64/snappy-sinksource.o target/snappy-1.0.5-NetBSD-amd64/snappy-stubs-internal.o target/snappy-1.0.5-NetBSD-amd64/snappy.o target/snappy-1.0.5-NetBSD-amd64/SnappyNative.o -shared -static-libgcc  
strip target/snappy-1.0.5-NetBSD-amd64/libsnappyjava.so
cp target/snappy-1.0.5-NetBSD-amd64/libsnappyjava.so src/main/resources/org/xerial/snappy/native/NetBSD/amd64/libsnappyjava.so
cp target/snappy-1.0.5-NetBSD-amd64/libsnappyjava.so target/classes/org/xerial/snappy/native/NetBSD/amd64/libsnappyjava.so
mvn -Duser.home=/data/scratch/devel/snappy-java10/work/.home -Dmaven.repo.local=/data/scratch/devel/snappy-java10/work/deps --offline package -Dmaven.test.skip=true
[INFO] Scanning for projects...
[INFO] 
[INFO] -------------------< org.xerial.snappy:snappy-java >--------------------
[INFO] Building Snappy for Java 1.0.5.4
[INFO] -------------------------------[ bundle ]-------------------------------
[INFO] 
[INFO] --- maven-enforcer-plugin:1.0:enforce (enforce-maven) @ snappy-java ---
[INFO] 
[INFO] --- maven-resources-plugin:2.5:resources (default-resources) @ snappy-java ---
[debug] execute contextualize
[INFO] Using 'UTF-8' encoding to copy filtered resources.
[INFO] Copying 1 resource
[INFO] Copying 2 resources
[INFO] Copying 1 resource to META-INF/maven/org.xerial.snappy/snappy-java
[INFO] 
[INFO] --- maven-compiler-plugin:2.0.2:compile (default-compile) @ snappy-java ---
[INFO] Compiling 13 source files to /data/scratch/devel/snappy-java10/work/snappy-java-1.0.5.4/target/classes
[INFO] ------------------------------------------------------------------------
[INFO] BUILD FAILURE
[INFO] ------------------------------------------------------------------------
[INFO] Total time: 10.889 s
[INFO] Finished at: 2020-06-17T10:49:38Z
[INFO] ------------------------------------------------------------------------
[ERROR] Failed to execute goal org.apache.maven.plugins:maven-compiler-plugin:2.0.2:compile (default-compile) on project snappy-java: Compilation failure: Compilation failure: 
[ERROR] error: Source option 5 is no longer supported. Use 6 or later.
[ERROR] error: Target option 1.5 is no longer supported. Use 1.6 or later.
[ERROR] -> [Help 1]
[ERROR] 
[ERROR] To see the full stack trace of the errors, re-run Maven with the -e switch.
[ERROR] Re-run Maven using the -X switch to enable full debug logging.
[ERROR] 
[ERROR] For more information about the errors and possible solutions, please read the following articles:
[ERROR] [Help 1] http://cwiki.apache.org/confluence/display/MAVEN/MojoFailureException
gmake: *** [Makefile:79: target/snappy-java-.jar] Error 1
*** Error code 2

Stop.
make[1]: stopped in /data/pkgsrc/devel/snappy-java10
*** Error code 1

Stop.
make: stopped in /data/pkgsrc/devel/snappy-java10