=> Bootstrap dependency digest>=20010302: found digest-20190127
===> Skipping vulnerability checks.
WARNING: No /var/db/pkg/pkg-vulnerabilities file found.
WARNING: To fix run: `/usr/sbin/pkg_admin -K /var/db/pkg fetch-pkg-vulnerabilities'.
===> Skipping vulnerability checks.
WARNING: No /var/db/pkg/pkg-vulnerabilities file found.
WARNING: To fix run: `/usr/sbin/pkg_admin -K /var/db/pkg fetch-pkg-vulnerabilities'.
===> Building for php73-sqlrelay-1.0.0nb14
/bin/sh ../../../libtool --mode=compile clang++ -O2 -I/usr/pkg/include -I/usr/include/krb5 -I/usr/include -I/usr/pkg/include/php/ext/pdo -Wall -pipe  -Wno-overloaded-virtual -I/usr/pkg/include -I/usr/include/krb5 -I/usr/include -I/usr/pkg/include/php/ext/pdo -I../../.. -I../../../src/api/c++ -I/usr/pkg/include -I/usr/pkg/include -I/usr/pkg/include -I/usr/pkg/include/php -I/usr/pkg/include/php/main -I/usr/pkg/include/php/TSRM -I/usr/pkg/include/php/Zend -I/usr/pkg/include/php/ext -I/usr/pkg/include/php/ext/date/lib -DCOMPILE_DL=1 -c sql_relay.cpp -o sql_relay.lo
libtool: compile:  clang++ -O2 -I/data/scratch/databases/php-sqlrelay/work/.buildlink/include -I/usr/include/krb5 -I/data/scratch/databases/php-sqlrelay/work/.buildlink/include/php/ext/pdo -Wall -pipe -Wno-overloaded-virtual -I../../.. -I../../../src/api/c++ -I/data/scratch/databases/php-sqlrelay/work/.buildlink/include/php -I/data/scratch/databases/php-sqlrelay/work/.buildlink/include/php/main -I/data/scratch/databases/php-sqlrelay/work/.buildlink/include/php/TSRM -I/data/scratch/databases/php-sqlrelay/work/.buildlink/include/php/Zend -I/data/scratch/databases/php-sqlrelay/work/.buildlink/include/php/ext -I/data/scratch/databases/php-sqlrelay/work/.buildlink/include/php/ext/date/lib -DCOMPILE_DL=1 -c sql_relay.cpp  -fPIC -DPIC -o .libs/sql_relay.o
sql_relay.cpp:2571:6: error: expected expression
        if (array_init(return_value) == FAILURE) {
            ^
/data/scratch/databases/php-sqlrelay/work/.buildlink/include/php/Zend/zend_API.h:377:28: note: expanded from macro 'array_init'
#define array_init(arg)                         ZVAL_ARR((arg), zend_new_array(0))
                                                ^
/data/scratch/databases/php-sqlrelay/work/.buildlink/include/php/Zend/zend_types.h:792:24: note: expanded from macro 'ZVAL_ARR'
#define ZVAL_ARR(z, a) do {                                             \
                       ^
sql_relay.cpp:2627:6: error: expected expression
        if (array_init(return_value) == FAILURE) {
            ^
/data/scratch/databases/php-sqlrelay/work/.buildlink/include/php/Zend/zend_API.h:377:28: note: expanded from macro 'array_init'
#define array_init(arg)                         ZVAL_ARR((arg), zend_new_array(0))
                                                ^
/data/scratch/databases/php-sqlrelay/work/.buildlink/include/php/Zend/zend_types.h:792:24: note: expanded from macro 'ZVAL_ARR'
#define ZVAL_ARR(z, a) do {                                             \
                       ^
sql_relay.cpp:2673:6: error: expected expression
        if (array_init(return_value) == FAILURE) {
            ^
/data/scratch/databases/php-sqlrelay/work/.buildlink/include/php/Zend/zend_API.h:377:28: note: expanded from macro 'array_init'
#define array_init(arg)                         ZVAL_ARR((arg), zend_new_array(0))
                                                ^
/data/scratch/databases/php-sqlrelay/work/.buildlink/include/php/Zend/zend_types.h:792:24: note: expanded from macro 'ZVAL_ARR'
#define ZVAL_ARR(z, a) do {                                             \
                       ^
sql_relay.cpp:2718:6: error: expected expression
        if (array_init(return_value) == FAILURE) {
            ^
/data/scratch/databases/php-sqlrelay/work/.buildlink/include/php/Zend/zend_API.h:377:28: note: expanded from macro 'array_init'
#define array_init(arg)                         ZVAL_ARR((arg), zend_new_array(0))
                                                ^
/data/scratch/databases/php-sqlrelay/work/.buildlink/include/php/Zend/zend_types.h:792:24: note: expanded from macro 'ZVAL_ARR'
#define ZVAL_ARR(z, a) do {                                             \
                       ^
sql_relay.cpp:2751:6: error: expected expression
        if (array_init(return_value) == FAILURE) {
            ^
/data/scratch/databases/php-sqlrelay/work/.buildlink/include/php/Zend/zend_API.h:377:28: note: expanded from macro 'array_init'
#define array_init(arg)                         ZVAL_ARR((arg), zend_new_array(0))
                                                ^
/data/scratch/databases/php-sqlrelay/work/.buildlink/include/php/Zend/zend_types.h:792:24: note: expanded from macro 'ZVAL_ARR'
#define ZVAL_ARR(z, a) do {                                             \
                       ^
5 errors generated.
gmake: *** [Makefile:8: sql_relay.lo] Error 1
*** Error code 2

Stop.
make[1]: stopped in /data/pkgsrc/databases/php-sqlrelay
*** Error code 1

Stop.
make: stopped in /data/pkgsrc/databases/php-sqlrelay