=> Bootstrap dependency digest>=20010302: found digest-20190127
===> Skipping vulnerability checks.
WARNING: No /var/db/pkg/pkg-vulnerabilities file found.
WARNING: To fix run: `/usr/sbin/pkg_admin -K /var/db/pkg fetch-pkg-vulnerabilities'.
===> Skipping vulnerability checks.
WARNING: No /var/db/pkg/pkg-vulnerabilities file found.
WARNING: To fix run: `/usr/sbin/pkg_admin -K /var/db/pkg fetch-pkg-vulnerabilities'.
===> Building for mariadb-client-5.5.67
Scanning dependencies of target INFO_BIN
Scanning dependencies of target INFO_SRC
Scanning dependencies of target regex
Scanning dependencies of target yassl
Scanning dependencies of target vio
[  1%] Building CXX object extra/yassl/CMakeFiles/yassl.dir/src/buffer.cpp.o
[  2%] Building C object regex/CMakeFiles/regex.dir/regcomp.c.o
Scanning dependencies of target taocrypt
[  2%] Building C object vio/CMakeFiles/vio.dir/vio.c.o
Scanning dependencies of target dbug-unit-tests
[  2%] Building CXX object extra/yassl/taocrypt/CMakeFiles/taocrypt.dir/src/aes.cpp.o
[  2%] Built target INFO_SRC
[  2%] Generating dbug-t
[  2%] Built target INFO_BIN
[  2%] Built target dbug-unit-tests
Scanning dependencies of target mysqlservices
Scanning dependencies of target comp_sql
Scanning dependencies of target strings
[  2%] Building CXX object extra/yassl/CMakeFiles/yassl.dir/src/cert_wrapper.cpp.o
[  3%] Building C object libservices/CMakeFiles/mysqlservices.dir/my_snprintf_service.c.o
Scanning dependencies of target innochecksum
[  3%] Building C object vio/CMakeFiles/vio.dir/viosocket.c.o
[  3%] Building C object strings/CMakeFiles/strings.dir/bchange.c.o
[  3%] Building C object scripts/CMakeFiles/comp_sql.dir/comp_sql.c.o
[  3%] Building C object libservices/CMakeFiles/mysqlservices.dir/thd_alloc_service.c.o
[  3%] Building C object extra/CMakeFiles/innochecksum.dir/innochecksum.c.o
[  3%] Linking C executable comp_sql
[  3%] Building C object libservices/CMakeFiles/mysqlservices.dir/thd_wait_service.c.o
[  3%] Built target comp_sql
[  4%] Building C object strings/CMakeFiles/strings.dir/bmove_upp.c.o
[  5%] Building CXX object extra/yassl/taocrypt/CMakeFiles/taocrypt.dir/src/aestables.cpp.o
[  5%] Building C object strings/CMakeFiles/strings.dir/ctype-big5.c.o
[  6%] Building C object libservices/CMakeFiles/mysqlservices.dir/my_thread_scheduler_service.c.o
[  7%] Building C object vio/CMakeFiles/vio.dir/viossl.c.o
[  8%] Linking C executable innochecksum
[  8%] Building CXX object extra/yassl/taocrypt/CMakeFiles/taocrypt.dir/src/algebra.cpp.o
[  8%] Building CXX object extra/yassl/taocrypt/CMakeFiles/taocrypt.dir/src/arc4.cpp.o
[  8%] Building C object libservices/CMakeFiles/mysqlservices.dir/progress_report_service.c.o
[  8%] Building CXX object extra/yassl/CMakeFiles/yassl.dir/src/crypto_wrapper.cpp.o
[  8%] Building C object libservices/CMakeFiles/mysqlservices.dir/debug_sync_service.c.o
[  8%] Built target innochecksum
[  9%] Building CXX object extra/yassl/taocrypt/CMakeFiles/taocrypt.dir/src/asn.cpp.o
[  9%] Building C object strings/CMakeFiles/strings.dir/ctype-bin.c.o
[  9%] Building C object libservices/CMakeFiles/mysqlservices.dir/kill_statement_service.c.o
[  9%] Building C object regex/CMakeFiles/regex.dir/regerror.c.o
[ 10%] Building C object libservices/CMakeFiles/mysqlservices.dir/logger_service.c.o
[ 10%] Building C object vio/CMakeFiles/vio.dir/viosslfactories.c.o
[ 10%] Linking C static library libmysqlservices.a
[ 10%] Built target mysqlservices
[ 10%] Building CXX object extra/yassl/taocrypt/CMakeFiles/taocrypt.dir/src/coding.cpp.o
[ 11%] Building C object strings/CMakeFiles/strings.dir/ctype-cp932.c.o
[ 11%] Building C object strings/CMakeFiles/strings.dir/ctype-czech.c.o
[ 11%] Building C object strings/CMakeFiles/strings.dir/ctype-euc_kr.c.o
[ 11%] Building C object regex/CMakeFiles/regex.dir/regexec.c.o
[ 11%] Linking C static library libvio.a
[ 11%] Built target vio
[ 11%] Building CXX object extra/yassl/taocrypt/CMakeFiles/taocrypt.dir/src/des.cpp.o
/data/scratch/databases/mariadb55-client/work/mariadb-5.5.67/extra/yassl/taocrypt/src/des.cpp:227:5: warning: 'register' storage class specifier is deprecated and incompatible with C++17 [-Wdeprecated-register]
    register int i,j,l;
    ^~~~~~~~~
/data/scratch/databases/mariadb55-client/work/mariadb-5.5.67/extra/yassl/taocrypt/src/des.cpp:227:5: warning: 'register' storage class specifier is deprecated and incompatible with C++17 [-Wdeprecated-register]
    register int i,j,l;
    ^~~~~~~~~
/data/scratch/databases/mariadb55-client/work/mariadb-5.5.67/extra/yassl/taocrypt/src/des.cpp:227:5: warning: 'register' storage class specifier is deprecated and incompatible with C++17 [-Wdeprecated-register]
    register int i,j,l;
    ^~~~~~~~~
[ 12%] Building CXX object extra/yassl/taocrypt/CMakeFiles/taocrypt.dir/src/dh.cpp.o
[ 13%] Building C object strings/CMakeFiles/strings.dir/ctype-eucjpms.c.o
[ 14%] Building CXX object extra/yassl/CMakeFiles/yassl.dir/src/handshake.cpp.o
3 warnings generated.
[ 14%] Building CXX object extra/yassl/CMakeFiles/yassl.dir/src/lock.cpp.o
[ 14%] Building CXX object extra/yassl/taocrypt/CMakeFiles/taocrypt.dir/src/dsa.cpp.o
[ 14%] Building CXX object extra/yassl/taocrypt/CMakeFiles/taocrypt.dir/src/file.cpp.o
[ 15%] Building CXX object extra/yassl/taocrypt/CMakeFiles/taocrypt.dir/src/hash.cpp.o
[ 15%] Building C object strings/CMakeFiles/strings.dir/ctype-extra.c.o
[ 15%] Building C object regex/CMakeFiles/regex.dir/regfree.c.o
[ 15%] Building CXX object extra/yassl/CMakeFiles/yassl.dir/src/log.cpp.o
[ 15%] Building C object strings/CMakeFiles/strings.dir/ctype-gb2312.c.o
[ 16%] Building C object strings/CMakeFiles/strings.dir/ctype-gbk.c.o
[ 16%] Building C object strings/CMakeFiles/strings.dir/ctype-latin1.c.o
[ 16%] Building CXX object extra/yassl/taocrypt/CMakeFiles/taocrypt.dir/src/integer.cpp.o
[ 17%] Building CXX object extra/yassl/CMakeFiles/yassl.dir/src/socket_wrapper.cpp.o
[ 18%] Building C object regex/CMakeFiles/regex.dir/reginit.c.o
[ 18%] Building CXX object extra/yassl/taocrypt/CMakeFiles/taocrypt.dir/src/md2.cpp.o
[ 18%] Building C object strings/CMakeFiles/strings.dir/ctype-mb.c.o
[ 18%] Linking C static library libregex.a
[ 18%] Built target regex
[ 18%] Building C object strings/CMakeFiles/strings.dir/ctype-simple.c.o
[ 18%] Building CXX object extra/yassl/CMakeFiles/yassl.dir/src/ssl.cpp.o
[ 19%] Building C object strings/CMakeFiles/strings.dir/ctype-sjis.c.o
[ 19%] Building C object strings/CMakeFiles/strings.dir/ctype-tis620.c.o
[ 19%] Building C object strings/CMakeFiles/strings.dir/ctype-uca.c.o
[ 20%] Building C object strings/CMakeFiles/strings.dir/ctype-ucs2.c.o
[ 21%] Building CXX object extra/yassl/taocrypt/CMakeFiles/taocrypt.dir/src/md4.cpp.o
[ 21%] Building CXX object extra/yassl/CMakeFiles/yassl.dir/src/timer.cpp.o
[ 21%] Building C object strings/CMakeFiles/strings.dir/ctype-ujis.c.o
[ 21%] Building C object strings/CMakeFiles/strings.dir/ctype-utf8.c.o
[ 22%] Building CXX object extra/yassl/CMakeFiles/yassl.dir/src/yassl_error.cpp.o
[ 22%] Building CXX object extra/yassl/taocrypt/CMakeFiles/taocrypt.dir/src/md5.cpp.o
[ 22%] Building CXX object extra/yassl/CMakeFiles/yassl.dir/src/yassl_imp.cpp.o
[ 23%] Building C object strings/CMakeFiles/strings.dir/ctype-win1250ch.c.o
[ 23%] Building CXX object extra/yassl/taocrypt/CMakeFiles/taocrypt.dir/src/misc.cpp.o
[ 23%] Building C object strings/CMakeFiles/strings.dir/ctype.c.o
[ 23%] Building C object strings/CMakeFiles/strings.dir/decimal.c.o
[ 24%] Building C object strings/CMakeFiles/strings.dir/dtoa.c.o
[ 25%] Building CXX object extra/yassl/taocrypt/CMakeFiles/taocrypt.dir/src/random.cpp.o
[ 25%] Building C object strings/CMakeFiles/strings.dir/int2str.c.o
[ 25%] Building CXX object extra/yassl/CMakeFiles/yassl.dir/src/yassl_int.cpp.o
[ 25%] Building CXX object extra/yassl/taocrypt/CMakeFiles/taocrypt.dir/src/ripemd.cpp.o
[ 25%] Building CXX object extra/yassl/taocrypt/CMakeFiles/taocrypt.dir/src/rsa.cpp.o
[ 25%] Building C object strings/CMakeFiles/strings.dir/is_prefix.c.o
[ 26%] Building CXX object extra/yassl/taocrypt/CMakeFiles/taocrypt.dir/src/sha.cpp.o
[ 26%] Building CXX object extra/yassl/taocrypt/CMakeFiles/taocrypt.dir/src/rabbit.cpp.o
[ 27%] Building C object strings/CMakeFiles/strings.dir/llstr.c.o
[ 27%] Building C object strings/CMakeFiles/strings.dir/longlong2str.c.o
[ 27%] Building C object strings/CMakeFiles/strings.dir/my_strtoll10.c.o
[ 27%] Building CXX object extra/yassl/taocrypt/CMakeFiles/taocrypt.dir/src/hc128.cpp.o
[ 28%] Building C object strings/CMakeFiles/strings.dir/my_vsnprintf.c.o
[ 28%] Building C object strings/CMakeFiles/strings.dir/str2int.c.o
[ 28%] Building C object strings/CMakeFiles/strings.dir/str_alloc.c.o
[ 29%] Building C object strings/CMakeFiles/strings.dir/strcend.c.o
[ 29%] Building C object strings/CMakeFiles/strings.dir/strend.c.o
[ 29%] Building C object strings/CMakeFiles/strings.dir/strfill.c.o
[ 29%] Building C object strings/CMakeFiles/strings.dir/strmake.c.o
Scanning dependencies of target GenFixPrivs
[ 29%] Generating mysql_fix_privilege_tables_sql.c
[ 29%] Built target GenFixPrivs
[ 30%] Building C object strings/CMakeFiles/strings.dir/strmov.c.o
[ 30%] Building C object strings/CMakeFiles/strings.dir/strnmov.c.o
[ 30%] Building C object strings/CMakeFiles/strings.dir/strxmov.c.o
[ 31%] Building C object strings/CMakeFiles/strings.dir/strxnmov.c.o
[ 31%] Building C object strings/CMakeFiles/strings.dir/xml.c.o
[ 31%] Building C object strings/CMakeFiles/strings.dir/strmov_overlapp.c.o
[ 32%] Building C object strings/CMakeFiles/strings.dir/my_strchr.c.o
[ 32%] Building C object strings/CMakeFiles/strings.dir/strcont.c.o
[ 32%] Building C object strings/CMakeFiles/strings.dir/strappend.c.o
[ 33%] Linking C static library libstrings.a
[ 33%] Built target strings
[ 33%] Linking CXX static library libtaocrypt.a
[ 33%] Built target taocrypt
Scanning dependencies of target mysys
[ 34%] Building C object mysys/CMakeFiles/mysys.dir/array.c.o
[ 34%] Building C object mysys/CMakeFiles/mysys.dir/charset.c.o
[ 34%] Building C object mysys/CMakeFiles/mysys.dir/default.c.o
[ 34%] Building C object mysys/CMakeFiles/mysys.dir/checksum.c.o
[ 34%] Building C object mysys/CMakeFiles/mysys.dir/errors.c.o
[ 34%] Building C object mysys/CMakeFiles/mysys.dir/hash.c.o
[ 35%] Building C object mysys/CMakeFiles/mysys.dir/charset-def.c.o
[ 36%] Building C object mysys/CMakeFiles/mysys.dir/list.c.o
[ 36%] Building C object mysys/CMakeFiles/mysys.dir/md5.c.o
[ 36%] Building C object mysys/CMakeFiles/mysys.dir/mf_cache.c.o
[ 37%] Building C object mysys/CMakeFiles/mysys.dir/mf_dirname.c.o
[ 37%] Building C object mysys/CMakeFiles/mysys.dir/mf_fn_ext.c.o
[ 37%] Building C object mysys/CMakeFiles/mysys.dir/mf_format.c.o
[ 38%] Linking CXX static library libyassl.a
[ 38%] Building C object mysys/CMakeFiles/mysys.dir/mf_getdate.c.o
[ 39%] Building C object mysys/CMakeFiles/mysys.dir/mf_iocache.c.o
[ 39%] Building C object mysys/CMakeFiles/mysys.dir/mf_iocache2.c.o
[ 39%] Built target yassl
[ 39%] Building C object mysys/CMakeFiles/mysys.dir/mf_keycache.c.o
[ 40%] Building C object mysys/CMakeFiles/mysys.dir/mf_keycaches.c.o
[ 40%] Building C object mysys/CMakeFiles/mysys.dir/mf_loadpath.c.o
[ 40%] Building C object mysys/CMakeFiles/mysys.dir/mf_pack.c.o
[ 41%] Building C object mysys/CMakeFiles/mysys.dir/mf_path.c.o
[ 41%] Building C object mysys/CMakeFiles/mysys.dir/mf_qsort.c.o
[ 41%] Building C object mysys/CMakeFiles/mysys.dir/mf_qsort2.c.o
[ 42%] Building C object mysys/CMakeFiles/mysys.dir/mf_radix.c.o
[ 42%] Building C object mysys/CMakeFiles/mysys.dir/mf_same.c.o
[ 42%] Building C object mysys/CMakeFiles/mysys.dir/mf_sort.c.o
[ 43%] Building C object mysys/CMakeFiles/mysys.dir/mf_soundex.c.o
[ 43%] Building C object mysys/CMakeFiles/mysys.dir/mf_arr_appstr.c.o
[ 43%] Building C object mysys/CMakeFiles/mysys.dir/mf_tempdir.c.o
[ 44%] Building C object mysys/CMakeFiles/mysys.dir/mf_tempfile.c.o
[ 44%] Building C object mysys/CMakeFiles/mysys.dir/mf_unixpath.c.o
[ 44%] Building C object mysys/CMakeFiles/mysys.dir/mf_wcomp.c.o
[ 45%] Building C object mysys/CMakeFiles/mysys.dir/mulalloc.c.o
[ 45%] Building C object mysys/CMakeFiles/mysys.dir/my_access.c.o
[ 45%] Building C object mysys/CMakeFiles/mysys.dir/my_aes.c.o
[ 45%] Building C object mysys/CMakeFiles/mysys.dir/my_alloc.c.o
[ 46%] Building C object mysys/CMakeFiles/mysys.dir/my_bit.c.o
[ 46%] Building C object mysys/CMakeFiles/mysys.dir/my_bitmap.c.o
[ 46%] Building C object mysys/CMakeFiles/mysys.dir/my_chsize.c.o
[ 47%] Building C object mysys/CMakeFiles/mysys.dir/my_compress.c.o
[ 47%] Building C object mysys/CMakeFiles/mysys.dir/my_copy.c.o
[ 47%] Building C object mysys/CMakeFiles/mysys.dir/my_create.c.o
[ 48%] Building C object mysys/CMakeFiles/mysys.dir/my_delete.c.o
[ 48%] Building C object mysys/CMakeFiles/mysys.dir/my_div.c.o
[ 48%] Building C object mysys/CMakeFiles/mysys.dir/my_error.c.o
[ 49%] Building C object mysys/CMakeFiles/mysys.dir/my_file.c.o
[ 49%] Building C object mysys/CMakeFiles/mysys.dir/my_fopen.c.o
[ 49%] Building C object mysys/CMakeFiles/mysys.dir/my_fstream.c.o
[ 50%] Building C object mysys/CMakeFiles/mysys.dir/my_gethwaddr.c.o
[ 50%] Building C object mysys/CMakeFiles/mysys.dir/my_getopt.c.o
[ 50%] Building C object mysys/CMakeFiles/mysys.dir/my_getsystime.c.o
[ 50%] Building C object mysys/CMakeFiles/mysys.dir/my_compare.c.o
[ 51%] Building C object mysys/CMakeFiles/mysys.dir/my_getwd.c.o
[ 51%] Building C object mysys/CMakeFiles/mysys.dir/my_init.c.o
[ 52%] Building C object mysys/CMakeFiles/mysys.dir/my_lib.c.o
[ 52%] Building C object mysys/CMakeFiles/mysys.dir/my_malloc.c.o
[ 52%] Building C object mysys/CMakeFiles/mysys.dir/my_lock.c.o
[ 52%] Building C object mysys/CMakeFiles/mysys.dir/my_mess.c.o
[ 53%] Building C object mysys/CMakeFiles/mysys.dir/my_mkdir.c.o
[ 53%] Building C object mysys/CMakeFiles/mysys.dir/my_mmap.c.o
[ 53%] Building C object mysys/CMakeFiles/mysys.dir/my_once.c.o
[ 54%] Building C object mysys/CMakeFiles/mysys.dir/my_open.c.o
[ 54%] Building C object mysys/CMakeFiles/mysys.dir/my_pread.c.o
[ 54%] Building C object mysys/CMakeFiles/mysys.dir/my_pthread.c.o
[ 55%] Building C object mysys/CMakeFiles/mysys.dir/my_quick.c.o
[ 55%] Building C object mysys/CMakeFiles/mysys.dir/my_read.c.o
[ 55%] Building C object mysys/CMakeFiles/mysys.dir/my_redel.c.o
[ 56%] Building C object mysys/CMakeFiles/mysys.dir/my_rename.c.o
[ 56%] Building C object mysys/CMakeFiles/mysys.dir/my_seek.c.o
[ 56%] Building C object mysys/CMakeFiles/mysys.dir/my_sleep.c.o
[ 57%] Building C object mysys/CMakeFiles/mysys.dir/my_static.c.o
[ 57%] Building C object mysys/CMakeFiles/mysys.dir/my_symlink.c.o
[ 57%] Building C object mysys/CMakeFiles/mysys.dir/my_symlink2.c.o
[ 58%] Building C object mysys/CMakeFiles/mysys.dir/my_sync.c.o
[ 58%] Building C object mysys/CMakeFiles/mysys.dir/my_thr_init.c.o
[ 59%] Building C object mysys/CMakeFiles/mysys.dir/ptr_cmp.c.o
[ 59%] Building C object mysys/CMakeFiles/mysys.dir/my_write.c.o
[ 59%] Building C object mysys/CMakeFiles/mysys.dir/my_basename.c.o
[ 60%] Building C object mysys/CMakeFiles/mysys.dir/queues.c.o
[ 60%] Building C object mysys/CMakeFiles/mysys.dir/stacktrace.c.o
[ 60%] Building C object mysys/CMakeFiles/mysys.dir/rijndael.c.o
[ 60%] Building C object mysys/CMakeFiles/mysys.dir/sha1.c.o
[ 60%] Building C object mysys/CMakeFiles/mysys.dir/string.c.o
[ 61%] Building C object mysys/CMakeFiles/mysys.dir/thr_alarm.c.o
[ 61%] Building C object mysys/CMakeFiles/mysys.dir/thr_lock.c.o
[ 61%] Building C object mysys/CMakeFiles/mysys.dir/thr_mutex.c.o
[ 62%] Building C object mysys/CMakeFiles/mysys.dir/thr_rwlock.c.o
[ 62%] Building C object mysys/CMakeFiles/mysys.dir/tree.c.o
[ 62%] Building C object mysys/CMakeFiles/mysys.dir/typelib.c.o
[ 63%] Building C object mysys/CMakeFiles/mysys.dir/base64.c.o
[ 63%] Building C object mysys/CMakeFiles/mysys.dir/my_memmem.c.o
[ 63%] Building C object mysys/CMakeFiles/mysys.dir/my_getpagesize.c.o
[ 64%] Building C object mysys/CMakeFiles/mysys.dir/lf_alloc-pin.c.o
[ 64%] Building C object mysys/CMakeFiles/mysys.dir/lf_dynarray.c.o
[ 64%] Building C object mysys/CMakeFiles/mysys.dir/lf_hash.c.o
[ 65%] Building C object mysys/CMakeFiles/mysys.dir/safemalloc.c.o
[ 65%] Building CXX object mysys/CMakeFiles/mysys.dir/my_new.cc.o
[ 65%] Building C object mysys/CMakeFiles/mysys.dir/my_atomic.c.o
[ 66%] Building C object mysys/CMakeFiles/mysys.dir/my_getncpus.c.o
[ 66%] Building C object mysys/CMakeFiles/mysys.dir/my_safehash.c.o
[ 66%] Building C object mysys/CMakeFiles/mysys.dir/my_chmod.c.o
[ 67%] Building C object mysys/CMakeFiles/mysys.dir/my_rnd.c.o
[ 67%] Building C object mysys/CMakeFiles/mysys.dir/my_uuid.c.o
[ 67%] Building C object mysys/CMakeFiles/mysys.dir/wqueue.c.o
[ 67%] Building C object mysys/CMakeFiles/mysys.dir/waiting_threads.c.o
[ 68%] Building C object mysys/CMakeFiles/mysys.dir/ma_dyncol.c.o
[ 68%] Building C object mysys/CMakeFiles/mysys.dir/my_rdtsc.c.o
[ 68%] Building C object mysys/CMakeFiles/mysys.dir/my_context.c.o
[ 69%] Building C object mysys/CMakeFiles/mysys.dir/file_logger.c.o
[ 69%] Building C object mysys/CMakeFiles/mysys.dir/my_addr_resolve.c.o
[ 69%] Building C object mysys/CMakeFiles/mysys.dir/my_setuser.c.o
[ 70%] Building C object mysys/CMakeFiles/mysys.dir/my_alarm.c.o
[ 70%] Building C object mysys/CMakeFiles/mysys.dir/my_lockmem.c.o
[ 70%] Linking CXX static library libmysys.a
[ 70%] Built target mysys
Scanning dependencies of target dbug
[ 71%] Building C object dbug/CMakeFiles/dbug.dir/dbug.c.o
[ 71%] Linking CXX static library libdbug.a
[ 71%] Built target dbug
Scanning dependencies of target tests
Scanning dependencies of target factorial
Scanning dependencies of target mysql_waitpid
Scanning dependencies of target mysqld_safe_helper
Scanning dependencies of target resolveip
Scanning dependencies of target thr_lock
[ 72%] Building C object dbug/CMakeFiles/tests.dir/tests.c.o
[ 73%] Building C object extra/CMakeFiles/resolveip.dir/resolveip.c.o
Scanning dependencies of target replace
[ 73%] Building C object dbug/CMakeFiles/factorial.dir/my_main.c.o
[ 73%] Building C object mysys/CMakeFiles/thr_lock.dir/thr_lock.c.o
[ 73%] Building C object extra/CMakeFiles/replace.dir/replace.c.o
[ 73%] Building C object extra/CMakeFiles/mysqld_safe_helper.dir/mysqld_safe_helper.c.o
[ 73%] Building C object extra/CMakeFiles/mysql_waitpid.dir/mysql_waitpid.c.o
Scanning dependencies of target comp_err
[ 73%] Building C object extra/CMakeFiles/comp_err.dir/comp_err.c.o
[ 73%] Linking CXX executable tests
[ 73%] Linking CXX executable resolveip
[ 74%] Linking CXX executable mysqld_safe_helper
[ 74%] Built target tests
[ 75%] Building C object dbug/CMakeFiles/factorial.dir/factorial.c.o
[ 75%] Linking CXX executable mysql_waitpid
Scanning dependencies of target resolve_stack_dump
[ 75%] Building C object extra/CMakeFiles/resolve_stack_dump.dir/resolve_stack_dump.c.o
[ 75%] Built target resolveip
[ 75%] Built target mysql_waitpid
Scanning dependencies of target my_print_defaults
[ 76%] Linking CXX executable factorial
[ 76%] Building C object extra/CMakeFiles/my_print_defaults.dir/my_print_defaults.c.o
[ 76%] Built target mysqld_safe_helper
[ 76%] Built target factorial
Scanning dependencies of target t
Scanning dependencies of target ps
[ 77%] Generating output1.r, output2.r, output3.r, output4.r, output5.r
[ 77%] Generating example3.r
[ 77%] Generating example3.r
[ 77%] Generating factorial.r
[ 78%] Generating output1.r, output2.r, output3.r, output4.r, output5.r
[ 78%] Generating factorial.r
[ 78%] Generating main.r
[ 78%] Generating example2.r
[ 79%] Generating example1.r
[ 79%] Linking CXX executable my_print_defaults
[ 80%] Generating example1.r
[ 81%] Linking CXX executable comp_err
[ 82%] Linking CXX executable thr_lock
[ 82%] Generating main.r
[ 82%] Generating user.t
[ 82%] Generating user.ps
[ 82%] Built target my_print_defaults
[ 82%] Built target comp_err
Scanning dependencies of target GenError
[ 82%] Generating ../include/mysqld_error.h.tmp
[ 82%] Built target t
[ 82%] Built target ps
[ 82%] Linking CXX executable resolve_stack_dump
[ 82%] Built target thr_lock
[ 82%] Built target GenError
Scanning dependencies of target perror
[ 82%] Built target resolve_stack_dump
[ 83%] Building C object extra/CMakeFiles/perror.dir/perror.c.o
Scanning dependencies of target clientlib
[ 83%] Building C object libmysql/CMakeFiles/clientlib.dir/libmysql.c.o
[ 83%] Building C object libmysql/CMakeFiles/clientlib.dir/__/sql-common/my_time.c.o
[ 84%] Building C object libmysql/CMakeFiles/clientlib.dir/__/sql-common/client.c.o
[ 84%] Building C object libmysql/CMakeFiles/clientlib.dir/errmsg.c.o
[ 84%] Building C object libmysql/CMakeFiles/clientlib.dir/__/sql-common/mysql_async.c.o
[ 85%] Building C object libmysql/CMakeFiles/clientlib.dir/get_password.c.o
[ 86%] Linking CXX executable replace
In file included from /data/scratch/databases/mariadb55-client/work/mariadb-5.5.67/sql-common/my_time.c:17:
/data/scratch/databases/mariadb55-client/work/mariadb-5.5.67/include/my_time.h:115:22: warning: implicit conversion from 'long long' to 'double' changes value from 9223372036854775807 to 9223372036854775808 [-Wimplicit-const-int-float-conversion]
  if (nr < 0 || nr > LONGLONG_MAX)
                   ~ ^~~~~~~~~~~~
/data/scratch/databases/mariadb55-client/work/mariadb-5.5.67/include/my_global.h:749:23: note: expanded from macro 'LONGLONG_MAX'
#define LONGLONG_MAX    ((long long) 0x7FFFFFFFFFFFFFFFLL)
                         ^~~~~~~~~~~~~~~~~~~~~~~~~~~~~~~~
In file included from /data/scratch/databases/mariadb55-client/work/mariadb-5.5.67/libmysql/libmysql.c:23:
/data/scratch/databases/mariadb55-client/work/mariadb-5.5.67/include/my_time.h:115:22: warning: implicit conversion from 'long long' to 'double' changes value from 9223372036854775807 to 9223372036854775808 [-Wimplicit-const-int-float-conversion]
  if (nr < 0 || nr > LONGLONG_MAX)
                   ~ ^~~~~~~~~~~~
/data/scratch/databases/mariadb55-client/work/mariadb-5.5.67/include/my_global.h:749:23: note: expanded from macro 'LONGLONG_MAX'
#define LONGLONG_MAX    ((long long) 0x7FFFFFFFFFFFFFFFLL)
                         ^~~~~~~~~~~~~~~~~~~~~~~~~~~~~~~~
[ 86%] Built target replace
[ 87%] Building C object libmysql/CMakeFiles/clientlib.dir/__/sql-common/client_plugin.c.o
/data/scratch/databases/mariadb55-client/work/mariadb-5.5.67/libmysql/libmysql.c:891:50: warning: passing 'const char *' to parameter of type 'const unsigned char *' converts between pointers to integer types with different sign [-Wpointer-sign]
  DBUG_RETURN(simple_command(mysql,COM_CREATE_DB,db, (ulong) strlen(db),0));
                                                 ^~
/data/scratch/databases/mariadb55-client/work/mariadb-5.5.67/include/sql_common.h:77:44: note: expanded from macro 'simple_command'
                                        0, arg, length, skip_check, NULL)
                                           ^~~
/data/scratch/databases/mariadb55-client/work/mariadb-5.5.67/include/my_dbug.h:135:53: note: expanded from macro 'DBUG_RETURN'
#define DBUG_RETURN(a1)                 do { return(a1); } while(0)
                                                    ^~
/data/scratch/databases/mariadb55-client/work/mariadb-5.5.67/libmysql/libmysql.c:900:48: warning: passing 'const char *' to parameter of type 'const unsigned char *' converts between pointers to integer types with different sign [-Wpointer-sign]
  DBUG_RETURN(simple_command(mysql,COM_DROP_DB,db,(ulong) strlen(db),0));
                                               ^~
/data/scratch/databases/mariadb55-client/work/mariadb-5.5.67/include/sql_common.h:77:44: note: expanded from macro 'simple_command'
                                        0, arg, length, skip_check, NULL)
                                           ^~~
/data/scratch/databases/mariadb55-client/work/mariadb-5.5.67/include/my_dbug.h:135:53: note: expanded from macro 'DBUG_RETURN'
#define DBUG_RETURN(a1)                 do { return(a1); } while(0)
                                                    ^~
/data/scratch/databases/mariadb55-client/work/mariadb-5.5.67/libmysql/libmysql.c:1406:12: warning: address of array 'net->last_error' will always evaluate to 'true' [-Wpointer-bool-conversion]
  if (net->last_error && net->last_error[0])
      ~~~~~^~~~~~~~~~ ~~
[ 87%] Building CXX object libmysql/CMakeFiles/clientlib.dir/__/sql/net_serv.cc.o
[ 87%] Building C object libmysql/CMakeFiles/clientlib.dir/__/sql-common/pack.c.o
[ 87%] Linking CXX executable perror
[ 88%] Building C object libmysql/CMakeFiles/clientlib.dir/__/sql/password.c.o
[ 88%] Built target perror
1 warning generated.
4 warnings generated.
[ 88%] Linking CXX static library libclientlib.a
[ 88%] Built target clientlib
[ 88%] Generating mysqlclient_depends.c
Scanning dependencies of target libmysql
[ 88%] Building CXX object libmysql/CMakeFiles/libmysql.dir/libmysql_exports_file.cc.o
Scanning dependencies of target mysqlclient
[ 89%] Building C object libmysql/CMakeFiles/mysqlclient.dir/mysqlclient_depends.c.o
[ 89%] Linking CXX shared library libmysqlclient.so
[ 89%] Linking C static library libmysqlclient.a
/usr/bin/ar: creating /data/scratch/databases/mariadb55-client/work/mariadb-5.5.67/libmysql/libmysqlclient.a
[ 89%] Built target mysqlclient
Scanning dependencies of target symlink_libmysqlclient_r.a
Scanning dependencies of target mysqlbinlog
Scanning dependencies of target mysql
Scanning dependencies of target mysqladmin
[ 89%] Building CXX object client/CMakeFiles/mysqlbinlog.dir/mysqlbinlog.cc.o
Scanning dependencies of target mysqldump
[ 89%] Building CXX object client/CMakeFiles/mysql.dir/completion_hash.cc.o
Scanning dependencies of target async_example
[ 89%] Building C object client/CMakeFiles/async_example.dir/async_example.c.o
Scanning dependencies of target mysql_plugin
[ 89%] Generating libmysqlclient_r.a
[ 89%] Built target symlink_libmysqlclient_r.a
[ 90%] Building C object client/CMakeFiles/mysql_plugin.dir/mysql_plugin.c.o
[ 90%] Building C object client/CMakeFiles/mysqldump.dir/mysqldump.c.o
[ 90%] Building CXX object client/CMakeFiles/mysqladmin.dir/mysqladmin.cc.o
[ 90%] Built target libmysql
[ 90%] Building C object client/CMakeFiles/mysqldump.dir/__/sql-common/my_user.c.o
Scanning dependencies of target mysql_upgrade
In file included from /data/scratch/databases/mariadb55-client/work/mariadb-5.5.67/client/mysqlbinlog.cc:36:
/data/scratch/databases/mariadb55-client/work/mariadb-5.5.67/include/my_time.h:115:22: warning: implicit conversion from 'long long' to 'double' changes value from 9223372036854775807 to 9223372036854775808 [-Wimplicit-const-int-float-conversion]
  if (nr < 0 || nr > LONGLONG_MAX)
                   ~ ^~~~~~~~~~~~
/data/scratch/databases/mariadb55-client/work/mariadb-5.5.67/include/my_global.h:749:23: note: expanded from macro 'LONGLONG_MAX'
#define LONGLONG_MAX    ((long long) 0x7FFFFFFFFFFFFFFFLL)
                         ^~~~~~~~~~~~~~~~~~~~~~~~~~~~~~~~
[ 91%] Linking CXX executable async_example
Scanning dependencies of target mysqlimport
[ 91%] Building C object client/CMakeFiles/mysqlimport.dir/mysqlimport.c.o
[ 91%] Built target async_example
[ 91%] Building C object client/CMakeFiles/mysql_upgrade.dir/mysql_upgrade.c.o
Scanning dependencies of target mysqlshow
[ 91%] Building C object client/CMakeFiles/mysqlshow.dir/mysqlshow.c.o
[ 92%] Building CXX object client/CMakeFiles/mysql.dir/mysql.cc.o
In file included from /data/scratch/databases/mariadb55-client/work/mariadb-5.5.67/client/mysqlbinlog.cc:2572:
/data/scratch/databases/mariadb55-client/work/mariadb-5.5.67/sql/sql_string.cc:576:5: warning: 'register' storage class specifier is deprecated and incompatible with C++17 [-Wdeprecated-register]
    register const char *str = Ptr+offset;
    ^~~~~~~~~
/data/scratch/databases/mariadb55-client/work/mariadb-5.5.67/sql/sql_string.cc:577:5: warning: 'register' storage class specifier is deprecated and incompatible with C++17 [-Wdeprecated-register]
    register const char *search=s.ptr();
    ^~~~~~~~~
/data/scratch/databases/mariadb55-client/work/mariadb-5.5.67/sql/sql_string.cc:585:2: warning: 'register' storage class specifier is deprecated and incompatible with C++17 [-Wdeprecated-register]
        register char *i,*j;
        ^~~~~~~~~
/data/scratch/databases/mariadb55-client/work/mariadb-5.5.67/sql/sql_string.cc:585:2: warning: 'register' storage class specifier is deprecated and incompatible with C++17 [-Wdeprecated-register]
        register char *i,*j;
        ^~~~~~~~~
/data/scratch/databases/mariadb55-client/work/mariadb-5.5.67/sql/sql_string.cc:606:5: warning: 'register' storage class specifier is deprecated and incompatible with C++17 [-Wdeprecated-register]
    register const char *str = Ptr+offset-1;
    ^~~~~~~~~
/data/scratch/databases/mariadb55-client/work/mariadb-5.5.67/sql/sql_string.cc:607:5: warning: 'register' storage class specifier is deprecated and incompatible with C++17 [-Wdeprecated-register]
    register const char *search=s.ptr()+s.length()-1;
    ^~~~~~~~~
/data/scratch/databases/mariadb55-client/work/mariadb-5.5.67/sql/sql_string.cc:616:2: warning: 'register' storage class specifier is deprecated and incompatible with C++17 [-Wdeprecated-register]
        register char *i,*j;
        ^~~~~~~~~
/data/scratch/databases/mariadb55-client/work/mariadb-5.5.67/sql/sql_string.cc:616:2: warning: 'register' storage class specifier is deprecated and incompatible with C++17 [-Wdeprecated-register]
        register char *i,*j;
        ^~~~~~~~~
[ 92%] Linking CXX executable mysql_plugin
[ 92%] Linking CXX executable mysqlimport
[ 92%] Built target mysql_plugin
Scanning dependencies of target mysqltest
[ 93%] Building CXX object client/CMakeFiles/mysqltest.dir/mysqltest.cc.o
[ 94%] Linking CXX executable mysql_upgrade
[ 94%] Built target mysqlimport
Scanning dependencies of target mysqlcheck
[ 95%] Building C object client/CMakeFiles/mysqlcheck.dir/mysqlcheck.c.o
[ 95%] Built target mysql_upgrade
Scanning dependencies of target mysqlslap
[ 96%] Linking CXX executable mysqladmin
[ 96%] Building C object client/CMakeFiles/mysqlslap.dir/mysqlslap.c.o
/data/scratch/databases/mariadb55-client/work/mariadb-5.5.67/client/mysql.cc:3101:3: warning: 'register' storage class specifier is deprecated and incompatible with C++17 [-Wdeprecated-register]
  reg1 int i, j;
  ^~~~~
/data/scratch/databases/mariadb55-client/work/mariadb-5.5.67/include/my_global.h:1025:14: note: expanded from macro 'reg1'
#define reg1 register
             ^
/data/scratch/databases/mariadb55-client/work/mariadb-5.5.67/client/mysql.cc:3101:3: warning: 'register' storage class specifier is deprecated and incompatible with C++17 [-Wdeprecated-register]
  reg1 int i, j;
  ^~~~~
/data/scratch/databases/mariadb55-client/work/mariadb-5.5.67/include/my_global.h:1025:14: note: expanded from macro 'reg1'
#define reg1 register
             ^
[ 96%] Built target mysqladmin
[ 97%] Linking CXX executable mysqlshow
Scanning dependencies of target async_queries
[ 97%] Building C object tests/CMakeFiles/async_queries.dir/async_queries.c.o
[ 97%] Built target mysqlshow
Scanning dependencies of target mysql_client_test
[ 97%] Building C object tests/CMakeFiles/mysql_client_test.dir/mysql_client_test.c.o
/data/scratch/databases/mariadb55-client/work/mariadb-5.5.67/client/mysqltest.cc:1022:3: warning: 'register' storage class specifier is deprecated and incompatible with C++17 [-Wdeprecated-register]
  register char c, next_c;
  ^~~~~~~~~
/data/scratch/databases/mariadb55-client/work/mariadb-5.5.67/client/mysqltest.cc:1022:3: warning: 'register' storage class specifier is deprecated and incompatible with C++17 [-Wdeprecated-register]
  register char c, next_c;
  ^~~~~~~~~
/data/scratch/databases/mariadb55-client/work/mariadb-5.5.67/client/mysqltest.cc:1023:3: warning: 'register' storage class specifier is deprecated and incompatible with C++17 [-Wdeprecated-register]
  register int escaped = 0;
  ^~~~~~~~~
/data/scratch/databases/mariadb55-client/work/mariadb-5.5.67/client/mysqltest.cc:2320:3: warning: 'register' storage class specifier is deprecated and incompatible with C++17 [-Wdeprecated-register]
  register char* key;
  ^~~~~~~~~
[ 97%] Linking CXX executable mysqlcheck
[ 97%] Linking C executable async_queries
[ 97%] Built target mysqlcheck
/data/scratch/databases/mariadb55-client/work/mariadb-5.5.67/client/mysqltest.cc:9783:25: warning: 'register' storage class specifier is deprecated and incompatible with C++17 [-Wdeprecated-register]
int insert_pointer_name(reg1 POINTER_ARRAY *pa,char * name);
                        ^~~~~
/data/scratch/databases/mariadb55-client/work/mariadb-5.5.67/include/my_global.h:1025:14: note: expanded from macro 'reg1'
#define reg1 register
             ^
/data/scratch/databases/mariadb55-client/work/mariadb-5.5.67/client/mysqltest.cc:9867:3: warning: 'register' storage class specifier is deprecated and incompatible with C++17 [-Wdeprecated-register]
  reg1 REPLACE *rep_pos;
  ^~~~~
/data/scratch/databases/mariadb55-client/work/mariadb-5.5.67/include/my_global.h:1025:14: note: expanded from macro 'reg1'
#define reg1 register
             ^
/data/scratch/databases/mariadb55-client/work/mariadb-5.5.67/client/mysqltest.cc:9868:3: warning: 'register' storage class specifier is deprecated and incompatible with C++17 [-Wdeprecated-register]
  reg2 REPLACE_STRING *rep_str;
  ^~~~~
/data/scratch/databases/mariadb55-client/work/mariadb-5.5.67/include/my_global.h:1026:14: note: expanded from macro 'reg2'
#define reg2 register
             ^
[ 97%] Building CXX object client/CMakeFiles/mysql.dir/readline.cc.o
/usr/bin/ld: ../libmysql/libmysqlclient.a(ssl.cpp.o):(.data.DW.ref.__gxx_personality_v0[DW.ref.__gxx_personality_v0]+0x0): undefined reference to `__gxx_personality_v0'
/usr/bin/ld: ../libmysql/libmysqlclient.a(yassl_imp.cpp.o): in function `__clang_call_terminate':
yassl_imp.cpp:(.text.__clang_call_terminate[__clang_call_terminate]+0x2): undefined reference to `__cxa_begin_catch'
/usr/bin/ld: yassl_imp.cpp:(.text.__clang_call_terminate[__clang_call_terminate]+0x7): undefined reference to `std::terminate()'
/usr/bin/ld: ../libmysql/libmysqlclient.a(yassl_imp.cpp.o):(.data.rel.ro+0x7d8): undefined reference to `vtable for __cxxabiv1::__si_class_type_info'
/usr/bin/ld: ../libmysql/libmysqlclient.a(yassl_imp.cpp.o):(.data.rel.ro+0x838): undefined reference to `vtable for __cxxabiv1::__si_class_type_info'
/usr/bin/ld: ../libmysql/libmysqlclient.a(yassl_imp.cpp.o):(.data.rel.ro+0x890): undefined reference to `vtable for __cxxabiv1::__si_class_type_info'
/usr/bin/ld: ../libmysql/libmysqlclient.a(yassl_imp.cpp.o):(.data.rel.ro+0x8e8): undefined reference to `vtable for __cxxabiv1::__si_class_type_info'
/usr/bin/ld: ../libmysql/libmysqlclient.a(yassl_imp.cpp.o):(.data.rel.ro+0x900): undefined reference to `vtable for __cxxabiv1::__si_class_type_info'
/usr/bin/ld: ../libmysql/libmysqlclient.a(yassl_imp.cpp.o):(.data.rel.ro+0x918): more undefined references to `vtable for __cxxabiv1::__si_class_type_info' follow
/usr/bin/ld: ../libmysql/libmysqlclient.a(yassl_imp.cpp.o):(.data.rel.ro._ZTIN5yaSSL12virtual_baseE[_ZTIN5yaSSL12virtual_baseE]+0x0): undefined reference to `vtable for __cxxabiv1::__class_type_info'
/usr/bin/ld: ../libmysql/libmysqlclient.a(yassl_imp.cpp.o):(.data.rel.ro._ZTIN5yaSSL7MessageE[_ZTIN5yaSSL7MessageE]+0x0): undefined reference to `vtable for __cxxabiv1::__si_class_type_info'
/usr/bin/ld: ../libmysql/libmysqlclient.a(yassl_imp.cpp.o):(.data.rel.ro._ZTIN5yaSSL13HandShakeBaseE[_ZTIN5yaSSL13HandShakeBaseE]+0x0): undefined reference to `vtable for __cxxabiv1::__si_class_type_info'
/usr/bin/ld: ../libmysql/libmysqlclient.a(yassl_imp.cpp.o):(.data.rel.ro._ZTIN5yaSSL10RSA_ServerE[_ZTIN5yaSSL10RSA_ServerE]+0x0): undefined reference to `vtable for __cxxabiv1::__si_class_type_info'
/usr/bin/ld: ../libmysql/libmysqlclient.a(yassl_imp.cpp.o):(.data.rel.ro._ZTIN5yaSSL15Fortezza_ServerE[_ZTIN5yaSSL15Fortezza_ServerE]+0x0): undefined reference to `vtable for __cxxabiv1::__si_class_type_info'
/usr/bin/ld: ../libmysql/libmysqlclient.a(yassl_imp.cpp.o):(.data.rel.ro._ZTIN5yaSSL12FortezzaKeysE[_ZTIN5yaSSL12FortezzaKeysE]+0x0): undefined reference to `vtable for __cxxabiv1::__si_class_type_info'
/usr/bin/ld: ../libmysql/libmysqlclient.a(asn.cpp.o):(.data.rel.ro+0x50): more undefined references to `vtable for __cxxabiv1::__si_class_type_info' follow
/usr/bin/ld: ../libmysql/libmysqlclient.a(asn.cpp.o):(.data.rel.ro._ZTIN8TaoCrypt12virtual_baseE[_ZTIN8TaoCrypt12virtual_baseE]+0x0): undefined reference to `vtable for __cxxabiv1::__class_type_info'
/usr/bin/ld: ../libmysql/libmysqlclient.a(asn.cpp.o):(.data.rel.ro._ZTIN8TaoCrypt11BER_DecoderE[_ZTIN8TaoCrypt11BER_DecoderE]+0x0): undefined reference to `vtable for __cxxabiv1::__si_class_type_info'
/usr/bin/ld: ../libmysql/libmysqlclient.a(asn.cpp.o):(.data.rel.ro._ZTIN8TaoCrypt11DER_EncoderE[_ZTIN8TaoCrypt11DER_EncoderE]+0x0): undefined reference to `vtable for __cxxabiv1::__si_class_type_info'
/usr/bin/ld: ../libmysql/libmysqlclient.a(asn.cpp.o):(.data.rel.ro._ZTIN8TaoCrypt17Signature_EncoderE[_ZTIN8TaoCrypt17Signature_EncoderE]+0x0): undefined reference to `vtable for __cxxabiv1::__si_class_type_info'
/usr/bin/ld: ../libmysql/libmysqlclient.a(dsa.cpp.o):(.data.rel.ro._ZTIN8TaoCrypt12AbstractRing20MultiplicativeGroupTE[_ZTIN8TaoCrypt12AbstractRing20MultiplicativeGroupTE]+0x0): undefined reference to `vtable for __cxxabiv1::__si_class_type_info'
/usr/bin/ld: ../libmysql/libmysqlclient.a(hash.cpp.o):(.data.rel.ro+0x30): undefined reference to `__cxa_pure_virtual'
/usr/bin/ld: ../libmysql/libmysqlclient.a(hash.cpp.o):(.data.rel.ro+0x38): undefined reference to `__cxa_pure_virtual'
/usr/bin/ld: ../libmysql/libmysqlclient.a(hash.cpp.o):(.data.rel.ro+0x40): undefined reference to `__cxa_pure_virtual'
/usr/bin/ld: ../libmysql/libmysqlclient.a(hash.cpp.o):(.data.rel.ro+0x48): undefined reference to `__cxa_pure_virtual'
/usr/bin/ld: ../libmysql/libmysqlclient.a(hash.cpp.o):(.data.rel.ro+0x50): undefined reference to `__cxa_pure_virtual'
/usr/bin/ld: ../libmysql/libmysqlclient.a(hash.cpp.o):(.data.rel.ro+0x58): more undefined references to `__cxa_pure_virtual' follow
/usr/bin/ld: ../libmysql/libmysqlclient.a(hash.cpp.o):(.data.rel.ro+0xc0): undefined reference to `vtable for __cxxabiv1::__si_class_type_info'
/usr/bin/ld: ../libmysql/libmysqlclient.a(hash.cpp.o):(.data.rel.ro+0xd8): undefined reference to `vtable for __cxxabiv1::__si_class_type_info'
/usr/bin/ld: ../libmysql/libmysqlclient.a(hash.cpp.o):(.data.rel.ro._ZTIN8TaoCrypt4HASHE[_ZTIN8TaoCrypt4HASHE]+0x0): undefined reference to `vtable for __cxxabiv1::__si_class_type_info'
/usr/bin/ld: /data/scratch/databases/mariadb55-client/work/mariadb-5.5.67/client/mysqltest.cc:10765:3: warning: 'register' storage class specifier is deprecated and incompatible with C++17 [-Wdeprecated-register]
  reg1 uint i;
  ^~~~~
/data/scratch/databases/mariadb55-client/work/mariadb-5.5.67/include/my_global.h:1025:14: note: expanded from macro 'reg1'
#define reg1 register
             ^
/data/scratch/databases/mariadb55-client/work/mariadb-5.5.67/client/mysqltest.cc:10867:25: warning: 'register' storage class specifier is deprecated and incompatible with C++17 [-Wdeprecated-register]
int insert_pointer_name(reg1 POINTER_ARRAY *pa,char * name)
                        ^~~~~
/data/scratch/databases/mariadb55-client/work/mariadb-5.5.67/include/my_global.h:1025:14: note: expanded from macro 'reg1'
#define reg1 register
             ^
../libmysql/libmysqlclient.a(integer.cpp.o):(.data.rel.ro+0x1d0): undefined reference to `vtable for __cxxabiv1::__si_class_type_info'
/usr/bin/ld: ../libmysql/libmysqlclient.a(integer.cpp.o):(.data.rel.ro+0x1e8): undefined reference to `vtable for __cxxabiv1::__si_class_type_info'
/usr/bin/ld: ../libmysql/libmysqlclient.a(integer.cpp.o):(.data.rel.ro._ZTIN8TaoCrypt17EuclideanDomainOfE[_ZTIN8TaoCrypt17EuclideanDomainOfE]+0x0): more undefined references to `vtable for __cxxabiv1::__si_class_type_info' follow
/usr/bin/ld: ../libmysql/libmysqlclient.a(algebra.cpp.o):(.data.rel.ro+0x20): undefined reference to `__cxa_pure_virtual'
/usr/bin/ld: ../libmysql/libmysqlclient.a(algebra.cpp.o):(.data.rel.ro+0x28): undefined reference to `__cxa_pure_virtual'
/usr/bin/ld: ../libmysql/libmysqlclient.a(algebra.cpp.o):(.data.rel.ro+0x30): undefined reference to `__cxa_pure_virtual'
/usr/bin/ld: ../libmysql/libmysqlclient.a(algebra.cpp.o):(.data.rel.ro+0x38): undefined reference to `__cxa_pure_virtual'
/usr/bin/ld: ../libmysql/libmysqlclient.a(algebra.cpp.o):(.data.rel.ro+0x80): undefined reference to `vtable for __cxxabiv1::__si_class_type_info'
/usr/bin/ld: ../libmysql/libmysqlclient.a(algebra.cpp.o):(.data.rel.ro+0xb8): undefined reference to `__cxa_pure_virtual'
/usr/bin/ld: ../libmysql/libmysqlclient.a(algebra.cpp.o):(.data.rel.ro+0xc0): undefined reference to `__cxa_pure_virtual'
/usr/bin/ld: ../libmysql/libmysqlclient.a(algebra.cpp.o):(.data.rel.ro+0xc8): undefined reference to `__cxa_pure_virtual'
/usr/bin/ld: ../libmysql/libmysqlclient.a(algebra.cpp.o):(.data.rel.ro+0xd0): undefined reference to `__cxa_pure_virtual'
/usr/bin/ld: ../libmysql/libmysqlclient.a(algebra.cpp.o):(.data.rel.ro+0x118): undefined reference to `__cxa_pure_virtual'
/usr/bin/ld: ../libmysql/libmysqlclient.a(algebra.cpp.o):(.data.rel.ro+0x120): more undefined references to `__cxa_pure_virtual' follow
/usr/bin/ld: ../libmysql/libmysqlclient.a(algebra.cpp.o):(.data.rel.ro+0x168): undefined reference to `vtable for __cxxabiv1::__si_class_type_info'
/usr/bin/ld: ../libmysql/libmysqlclient.a(algebra.cpp.o):(.data.rel.ro+0x1a0): undefined reference to `__cxa_pure_virtual'
/usr/bin/ld: ../libmysql/libmysqlclient.a(algebra.cpp.o):(.data.rel.ro+0x1a8): undefined reference to `__cxa_pure_virtual'
/usr/bin/ld: ../libmysql/libmysqlclient.a(algebra.cpp.o):(.data.rel.ro+0x1b0): undefined reference to `__cxa_pure_virtual'
/usr/bin/ld: ../libmysql/libmysqlclient.a(algebra.cpp.o):(.data.rel.ro+0x1b8): undefined reference to `__cxa_pure_virtual'
/usr/bin/ld: ../libmysql/libmysqlclient.a(algebra.cpp.o):(.data.rel.ro+0x200): undefined reference to `__cxa_pure_virtual'
/usr/bin/ld: ../libmysql/libmysqlclient.a(algebra.cpp.o):(.data.rel.ro+0x208): more undefined references to `__cxa_pure_virtual' follow
/usr/bin/ld: ../libmysql/libmysqlclient.a(algebra.cpp.o):(.data.rel.ro+0x268): undefined reference to `vtable for __cxxabiv1::__si_class_type_info'
/usr/bin/ld: ../libmysql/libmysqlclient.a(des.cpp.o):(.data.rel.ro+0x30): undefined reference to `vtable for __cxxabiv1::__vmi_class_type_info'
/usr/bin/ld: ../libmysql/libmysqlclient.a(des.cpp.o):(.data.rel.ro+0x98): undefined reference to `vtable for __cxxabiv1::__si_class_type_info'
/usr/bin/ld: ../libmysql/libmysqlclient.a(des.cpp.o):(.data.rel.ro+0xe0): undefined reference to `vtable for __cxxabiv1::__si_class_type_info'
/usr/bin/ld: ../libmysql/libmysqlclient.a(des.cpp.o):(.data.rel.ro._ZTIN8TaoCrypt8BasicDESE[_ZTIN8TaoCrypt8BasicDESE]+0x0): undefined reference to `vtable for __cxxabiv1::__class_type_info'
/usr/bin/ld: ../libmysql/libmysqlclient.a(ripemd.cpp.o):(.data.rel.ro+0x60): undefined reference to `vtable for __cxxabiv1::__si_class_type_info'
clang: error: linker command failed with exit code 1 (use -v to see invocation)
gmake[2]: *** [tests/CMakeFiles/async_queries.dir/build.make:106: tests/async_queries] Error 1
gmake[1]: *** [CMakeFiles/Makefile2:1910: tests/CMakeFiles/async_queries.dir/all] Error 2
gmake[1]: *** Waiting for unfinished jobs....
[ 97%] Building CXX object client/CMakeFiles/mysql.dir/__/sql/sql_string.cc.o
/data/scratch/databases/mariadb55-client/work/mariadb-5.5.67/sql/sql_string.cc:576:5: warning: 'register' storage class specifier is deprecated and incompatible with C++17 [-Wdeprecated-register]
    register const char *str = Ptr+offset;
    ^~~~~~~~~
/data/scratch/databases/mariadb55-client/work/mariadb-5.5.67/sql/sql_string.cc:577:5: warning: 'register' storage class specifier is deprecated and incompatible with C++17 [-Wdeprecated-register]
    register const char *search=s.ptr();
    ^~~~~~~~~
/data/scratch/databases/mariadb55-client/work/mariadb-5.5.67/sql/sql_string.cc:585:2: warning: 'register' storage class specifier is deprecated and incompatible with C++17 [-Wdeprecated-register]
        register char *i,*j;
        ^~~~~~~~~
/data/scratch/databases/mariadb55-client/work/mariadb-5.5.67/sql/sql_string.cc:585:2: warning: 'register' storage class specifier is deprecated and incompatible with C++17 [-Wdeprecated-register]
        register char *i,*j;
        ^~~~~~~~~
/data/scratch/databases/mariadb55-client/work/mariadb-5.5.67/sql/sql_string.cc:606:5: warning: 'register' storage class specifier is deprecated and incompatible with C++17 [-Wdeprecated-register]
    register const char *str = Ptr+offset-1;
    ^~~~~~~~~
/data/scratch/databases/mariadb55-client/work/mariadb-5.5.67/sql/sql_string.cc:607:5: warning: 'register' storage class specifier is deprecated and incompatible with C++17 [-Wdeprecated-register]
    register const char *search=s.ptr()+s.length()-1;
    ^~~~~~~~~
/data/scratch/databases/mariadb55-client/work/mariadb-5.5.67/sql/sql_string.cc:616:2: warning: 'register' storage class specifier is deprecated and incompatible with C++17 [-Wdeprecated-register]
        register char *i,*j;
        ^~~~~~~~~
/data/scratch/databases/mariadb55-client/work/mariadb-5.5.67/sql/sql_string.cc:616:2: warning: 'register' storage class specifier is deprecated and incompatible with C++17 [-Wdeprecated-register]
        register char *i,*j;
        ^~~~~~~~~
[ 97%] Linking CXX executable mysqlslap
[ 97%] Built target mysqlslap
[ 98%] Linking CXX executable mysqldump
[ 98%] Built target mysqldump
8 warnings generated.
2 warnings generated.
[ 99%] Linking CXX executable mysql
[ 99%] Built target mysql
9 warnings generated.
[ 99%] Linking CXX executable mysqlbinlog
[ 99%] Built target mysqlbinlog
9 warnings generated.
[ 99%] Linking CXX executable mysqltest
[ 99%] Built target mysqltest
[ 99%] Linking CXX executable mysql_client_test
[ 99%] Built target mysql_client_test
gmake: *** [Makefile:172: all] Error 2
*** Error code 2

Stop.
make[1]: stopped in /data/pkgsrc/databases/mariadb55-client
*** Error code 1

Stop.
make: stopped in /data/pkgsrc/databases/mariadb55-client