=> Bootstrap dependency digest>=20010302: found digest-20190127
===> Skipping vulnerability checks.
WARNING: No /var/db/pkg/pkg-vulnerabilities file found.
WARNING: To fix run: `/usr/sbin/pkg_admin -K /var/db/pkg fetch-pkg-vulnerabilities'.
===> Skipping vulnerability checks.
WARNING: No /var/db/pkg/pkg-vulnerabilities file found.
WARNING: To fix run: `/usr/sbin/pkg_admin -K /var/db/pkg fetch-pkg-vulnerabilities'.
===> Building for krita-4.2.9nb2
Scanning dependencies of target kritaversion_autogen
Scanning dependencies of target tsfiles-8d23dd21a1d44eb85bc132a9d2b50d4a
Scanning dependencies of target pofiles-8d23dd21a1d44eb85bc132a9d2b50d4a
[  0%] Automatic MOC for target kritaversion
[  0%] Generating ts...
[  0%] Generating mo...
[  0%] Built target tsfiles-8d23dd21a1d44eb85bc132a9d2b50d4a
[  0%] Built target kritaversion_autogen
Scanning dependencies of target kritaversion
[  0%] Building CXX object libs/version/CMakeFiles/kritaversion.dir/KritaVersionWrapper.cpp.o
[  0%] Building CXX object libs/version/CMakeFiles/kritaversion.dir/kritaversion_autogen/mocs_compilation.cpp.o
[  0%] Built target pofiles-8d23dd21a1d44eb85bc132a9d2b50d4a
[  0%] Linking CXX shared library libkritaversion.so
[  0%] Built target kritaversion
Scanning dependencies of target kritaglobal_autogen
[  0%] Automatic MOC for target kritaglobal
[  0%] Built target kritaglobal_autogen
Scanning dependencies of target kritaglobal
[  0%] Building CXX object libs/global/CMakeFiles/kritaglobal.dir/kis_shared.cpp.o
[  0%] Building CXX object libs/global/CMakeFiles/kritaglobal.dir/kis_memory_leak_tracker.cpp.o
[  0%] Building CXX object libs/global/CMakeFiles/kritaglobal.dir/kis_assert.cpp.o
[  0%] Building CXX object libs/global/CMakeFiles/kritaglobal.dir/kis_algebra_2d.cpp.o
[  0%] Building CXX object libs/global/CMakeFiles/kritaglobal.dir/kis_painting_tweaks.cpp.o
[  0%] Building CXX object libs/global/CMakeFiles/kritaglobal.dir/kis_debug.cpp.o
[  0%] Building CXX object libs/global/CMakeFiles/kritaglobal.dir/kritaglobal_autogen/mocs_compilation.cpp.o
[  0%] Building CXX object libs/global/CMakeFiles/kritaglobal.dir/kis_dom_utils.cpp.o
[  0%] Building CXX object libs/global/CMakeFiles/kritaglobal.dir/KisHandlePainterHelper.cpp.o
[  0%] Building CXX object libs/global/CMakeFiles/kritaglobal.dir/KisHandleStyle.cpp.o
[  0%] Building CXX object libs/global/CMakeFiles/kritaglobal.dir/kis_signal_compressor.cpp.o
[  0%] Building CXX object libs/global/CMakeFiles/kritaglobal.dir/kis_signal_compressor_with_param.cpp.o
In file included from /data/scratch/graphics/krita/work/krita-4.2.9/libs/global/kis_algebra_2d.cpp:25:
In file included from /data/scratch/graphics/krita/work/.buildlink/include/boost/accumulators/accumulators.hpp:12:
In file included from /data/scratch/graphics/krita/work/.buildlink/include/boost/accumulators/framework/accumulator_set.hpp:20:
In file included from /data/scratch/graphics/krita/work/.buildlink/include/boost/type_traits/is_base_of.hpp:12:
In file included from /data/scratch/graphics/krita/work/.buildlink/include/boost/type_traits/is_base_and_derived.hpp:12:
In file included from /data/scratch/graphics/krita/work/.buildlink/include/boost/type_traits/intrinsics.hpp:16:
/data/scratch/graphics/krita/work/.buildlink/include/boost/type_traits/detail/config.hpp:85:52: warning: '__clang_major___WORKAROUND_GUARD' is not defined, evaluates to 0 [-Wundef]
      && !BOOST_WORKAROUND(BOOST_MSVC, < 1900) && !BOOST_WORKAROUND(__clang_major__, <= 4)
                                                   ^
/data/scratch/graphics/krita/work/.buildlink/include/boost/config/workaround.hpp:246:10: note: expanded from macro 'BOOST_WORKAROUND'
       ((symbol ## _WORKAROUND_GUARD + 0 == 0) &&     \
         ^
<scratch space>:76:1: note: expanded from here
__clang_major___WORKAROUND_GUARD
^
[  0%] Building CXX object libs/global/CMakeFiles/kritaglobal.dir/kis_thread_safe_signal_compressor.cpp.o
[  0%] Building CXX object libs/global/CMakeFiles/kritaglobal.dir/kis_acyclic_signal_connector.cpp.o
In file included from /data/scratch/graphics/krita/work/krita-4.2.9/libs/global/kis_algebra_2d.cpp:25:
In file included from /data/scratch/graphics/krita/work/.buildlink/include/boost/accumulators/accumulators.hpp:12:
In file included from /data/scratch/graphics/krita/work/.buildlink/include/boost/accumulators/framework/accumulator_set.hpp:30:
In file included from /data/scratch/graphics/krita/work/.buildlink/include/boost/accumulators/framework/depends_on.hpp:13:
In file included from /data/scratch/graphics/krita/work/.buildlink/include/boost/mpl/map.hpp:36:
In file included from /data/scratch/graphics/krita/work/.buildlink/include/boost/mpl/map/map20.hpp:19:
In file included from /data/scratch/graphics/krita/work/.buildlink/include/boost/mpl/map/map10.hpp:19:
In file included from /data/scratch/graphics/krita/work/.buildlink/include/boost/mpl/map/map0.hpp:18:
In file included from /data/scratch/graphics/krita/work/.buildlink/include/boost/mpl/map/aux_/contains_impl.hpp:19:
In file included from /data/scratch/graphics/krita/work/.buildlink/include/boost/mpl/map/aux_/at_impl.hpp:21:
In file included from /data/scratch/graphics/krita/work/.buildlink/include/boost/mpl/aux_/order_impl.hpp:22:
In file included from /data/scratch/graphics/krita/work/.buildlink/include/boost/mpl/aux_/overload_names.hpp:18:
/data/scratch/graphics/krita/work/.buildlink/include/boost/mpl/aux_/config/operators.hpp:27:12: warning: '__NVCC___WORKAROUND_GUARD' is not defined, evaluates to 0 [-Wundef]
        || BOOST_WORKAROUND(__NVCC__, BOOST_TESTED_AT(1)) \
           ^
/data/scratch/graphics/krita/work/.buildlink/include/boost/config/workaround.hpp:246:10: note: expanded from macro 'BOOST_WORKAROUND'
       ((symbol ## _WORKAROUND_GUARD + 0 == 0) &&     \
         ^
<scratch space>:162:1: note: expanded from here
__NVCC___WORKAROUND_GUARD
^
In file included from /data/scratch/graphics/krita/work/krita-4.2.9/libs/global/kis_algebra_2d.cpp:25:
In file included from /data/scratch/graphics/krita/work/.buildlink/include/boost/accumulators/accumulators.hpp:12:
In file included from /data/scratch/graphics/krita/work/.buildlink/include/boost/accumulators/framework/accumulator_set.hpp:30:
In file included from /data/scratch/graphics/krita/work/.buildlink/include/boost/accumulators/framework/depends_on.hpp:13:
In file included from /data/scratch/graphics/krita/work/.buildlink/include/boost/mpl/map.hpp:36:
In file included from /data/scratch/graphics/krita/work/.buildlink/include/boost/mpl/map/map20.hpp:19:
In file included from /data/scratch/graphics/krita/work/.buildlink/include/boost/mpl/map/map10.hpp:19:
In file included from /data/scratch/graphics/krita/work/.buildlink/include/boost/mpl/map/map0.hpp:18:
In file included from /data/scratch/graphics/krita/work/.buildlink/include/boost/mpl/map/aux_/contains_impl.hpp:19:
In file included from /data/scratch/graphics/krita/work/.buildlink/include/boost/mpl/map/aux_/at_impl.hpp:21:
In file included from /data/scratch/graphics/krita/work/.buildlink/include/boost/mpl/aux_/order_impl.hpp:22:
In file included from /data/scratch/graphics/krita/work/.buildlink/include/boost/mpl/aux_/overload_names.hpp:18:
/data/scratch/graphics/krita/work/.buildlink/include/boost/mpl/aux_/config/operators.hpp:27:29: warning: '__NVCC__' is not defined, evaluates to 0 [-Wundef]
        || BOOST_WORKAROUND(__NVCC__, BOOST_TESTED_AT(1)) \
                            ^
[  0%] Building CXX object libs/global/CMakeFiles/kritaglobal.dir/kis_latency_tracker.cpp.o
[  0%] Building CXX object libs/global/CMakeFiles/kritaglobal.dir/KisQPainterStateSaver.cpp.o
/data/scratch/graphics/krita/work/krita-4.2.9/libs/global/KisHandlePainterHelper.cpp:172:22: error: variable has incomplete type 'QPainterPath'
        QPainterPath p;
                     ^
/data/scratch/graphics/krita/work/.buildlink/qt5/include/QtGui/qmatrix.h:54:7: note: forward declaration of 'QPainterPath'
class QPainterPath;
      ^
/data/scratch/graphics/krita/work/krita-4.2.9/libs/global/KisHandlePainterHelper.cpp:210:18: error: variable has incomplete type 'QPainterPath'
    QPainterPath p;
                 ^
/data/scratch/graphics/krita/work/.buildlink/qt5/include/QtGui/qmatrix.h:54:7: note: forward declaration of 'QPainterPath'
class QPainterPath;
      ^
/data/scratch/graphics/krita/work/krita-4.2.9/libs/global/KisHandlePainterHelper.cpp:236:18: error: variable has incomplete type 'QPainterPath'
    QPainterPath p;
                 ^
/data/scratch/graphics/krita/work/.buildlink/qt5/include/QtGui/qmatrix.h:54:7: note: forward declaration of 'QPainterPath'
class QPainterPath;
      ^
/data/scratch/graphics/krita/work/krita-4.2.9/libs/global/KisHandlePainterHelper.cpp:288:54: error: calling 'map' with incomplete return type 'QPainterPath'
    const QPainterPath realPath = m_painterTransform.map(path);
                                  ~~~~~~~~~~~~~~~~~~~^~~~~~~~~
/data/scratch/graphics/krita/work/.buildlink/qt5/include/QtGui/qtransform.h:155:18: note: 'map' declared here
    QPainterPath map(const QPainterPath &p) const;
                 ^
/data/scratch/graphics/krita/work/.buildlink/qt5/include/QtGui/qmatrix.h:54:7: note: forward declaration of 'QPainterPath'
class QPainterPath;
      ^
/data/scratch/graphics/krita/work/krita-4.2.9/libs/global/KisHandlePainterHelper.cpp:288:24: error: variable has incomplete type 'const QPainterPath'
    const QPainterPath realPath = m_painterTransform.map(path);
                       ^
/data/scratch/graphics/krita/work/.buildlink/qt5/include/QtGui/qmatrix.h:54:7: note: forward declaration of 'QPainterPath'
class QPainterPath;
      ^
/data/scratch/graphics/krita/work/krita-4.2.9/libs/global/KisHandlePainterHelper.cpp:319:18: error: variable has incomplete type 'QPainterPath'
    QPainterPath painterPath;
                 ^
/data/scratch/graphics/krita/work/.buildlink/qt5/include/QtGui/qmatrix.h:54:7: note: forward declaration of 'QPainterPath'
class QPainterPath;
      ^
/data/scratch/graphics/krita/work/krita-4.2.9/libs/global/KisHandlePainterHelper.cpp:326:24: error: variable has incomplete type 'const QPainterPath'
    const QPainterPath pathToSend = painterPath;
                       ^
/data/scratch/graphics/krita/work/.buildlink/qt5/include/QtGui/qmatrix.h:54:7: note: forward declaration of 'QPainterPath'
class QPainterPath;
      ^
[  0%] Building CXX object libs/global/CMakeFiles/kritaglobal.dir/KisSharedThreadPoolAdapter.cpp.o
7 errors generated.
gmake[2]: *** [libs/global/CMakeFiles/kritaglobal.dir/build.make:187: libs/global/CMakeFiles/kritaglobal.dir/KisHandlePainterHelper.cpp.o] Error 1
gmake[2]: *** Waiting for unfinished jobs....
In file included from /data/scratch/graphics/krita/work/krita-4.2.9/libs/global/kis_latency_tracker.cpp:19:
In file included from /data/scratch/graphics/krita/work/krita-4.2.9/libs/global/kis_latency_tracker.h:29:
In file included from /data/scratch/graphics/krita/work/.buildlink/include/boost/heap/fibonacci_heap.hpp:19:
In file included from /data/scratch/graphics/krita/work/.buildlink/include/boost/heap/detail/heap_comparison.hpp:15:
In file included from /data/scratch/graphics/krita/work/.buildlink/include/boost/heap/heap_concepts.hpp:12:
In file included from /data/scratch/graphics/krita/work/.buildlink/include/boost/concept_check.hpp:23:
In file included from /data/scratch/graphics/krita/work/.buildlink/include/boost/type_traits/conversion_traits.hpp:15:
In file included from /data/scratch/graphics/krita/work/.buildlink/include/boost/type_traits/is_convertible.hpp:15:
In file included from /data/scratch/graphics/krita/work/.buildlink/include/boost/type_traits/intrinsics.hpp:16:
/data/scratch/graphics/krita/work/.buildlink/include/boost/type_traits/detail/config.hpp:85:52: warning: '__clang_major___WORKAROUND_GUARD' is not defined, evaluates to 0 [-Wundef]
      && !BOOST_WORKAROUND(BOOST_MSVC, < 1900) && !BOOST_WORKAROUND(__clang_major__, <= 4)
                                                   ^
/data/scratch/graphics/krita/work/.buildlink/include/boost/config/workaround.hpp:246:10: note: expanded from macro 'BOOST_WORKAROUND'
       ((symbol ## _WORKAROUND_GUARD + 0 == 0) &&     \
         ^
<scratch space>:204:1: note: expanded from here
__clang_major___WORKAROUND_GUARD
^
In file included from /data/scratch/graphics/krita/work/krita-4.2.9/libs/global/kis_latency_tracker.cpp:19:
In file included from /data/scratch/graphics/krita/work/krita-4.2.9/libs/global/kis_latency_tracker.h:29:
In file included from /data/scratch/graphics/krita/work/.buildlink/include/boost/heap/fibonacci_heap.hpp:20:
/data/scratch/graphics/krita/work/.buildlink/include/boost/heap/detail/heap_node.hpp:44:25: warning: unused parameter 'n' [-Wunused-parameter]
    void operator()(T * n)
                        ^
In file included from /data/scratch/graphics/krita/work/krita-4.2.9/libs/global/kis_latency_tracker.cpp:19:
In file included from /data/scratch/graphics/krita/work/krita-4.2.9/libs/global/kis_latency_tracker.h:29:
In file included from /data/scratch/graphics/krita/work/.buildlink/include/boost/heap/fibonacci_heap.hpp:21:
In file included from /data/scratch/graphics/krita/work/.buildlink/include/boost/heap/detail/stable_heap.hpp:21:
/data/scratch/graphics/krita/work/.buildlink/include/boost/heap/heap_merge.hpp:33:38: warning: unused parameter 'lhs' [-Wunused-parameter]
        static void reserve (Heap1 & lhs, std::size_t required_size)
                                     ^
/data/scratch/graphics/krita/work/.buildlink/include/boost/heap/heap_merge.hpp:33:55: warning: unused parameter 'required_size' [-Wunused-parameter]
        static void reserve (Heap1 & lhs, std::size_t required_size)
                                                      ^
In file included from /data/scratch/graphics/krita/work/krita-4.2.9/libs/global/kis_latency_tracker.cpp:19:
In file included from /data/scratch/graphics/krita/work/krita-4.2.9/libs/global/kis_latency_tracker.h:29:
In file included from /data/scratch/graphics/krita/work/.buildlink/include/boost/heap/fibonacci_heap.hpp:21:
/data/scratch/graphics/krita/work/.buildlink/include/boost/heap/detail/stable_heap.hpp:99:32: warning: unused parameter 'rhs' [-Wunused-parameter]
    size_holder(size_holder && rhs) BOOST_NOEXCEPT
                               ^
/data/scratch/graphics/krita/work/.buildlink/include/boost/heap/detail/stable_heap.hpp:102:37: warning: unused parameter 'rhs' [-Wunused-parameter]
    size_holder(size_holder const & rhs) BOOST_NOEXCEPT
                                    ^
/data/scratch/graphics/krita/work/.buildlink/include/boost/heap/detail/stable_heap.hpp:105:44: warning: unused parameter 'rhs' [-Wunused-parameter]
    size_holder & operator=(size_holder && rhs) BOOST_NOEXCEPT
                                           ^
/data/scratch/graphics/krita/work/.buildlink/include/boost/heap/detail/stable_heap.hpp:110:49: warning: unused parameter 'rhs' [-Wunused-parameter]
    size_holder & operator=(size_holder const & rhs) BOOST_NOEXCEPT
                                                ^
In file included from /data/scratch/graphics/krita/work/krita-4.2.9/libs/global/kis_algebra_2d.cpp:27:
/data/scratch/graphics/krita/work/.buildlink/include/boost/accumulators/statistics/min.hpp:53:57: warning: unused parameter 'file_version' [-Wunused-parameter]
        void serialize(Archive & ar, const unsigned int file_version)
                                                        ^
In file included from /data/scratch/graphics/krita/work/krita-4.2.9/libs/global/kis_algebra_2d.cpp:28:
/data/scratch/graphics/krita/work/.buildlink/include/boost/accumulators/statistics/max.hpp:53:57: warning: unused parameter 'file_version' [-Wunused-parameter]
        void serialize(Archive & ar, const unsigned int file_version)
                                                        ^
In file included from /data/scratch/graphics/krita/work/krita-4.2.9/libs/global/kis_latency_tracker.cpp:19:
In file included from /data/scratch/graphics/krita/work/krita-4.2.9/libs/global/kis_latency_tracker.h:29:
In file included from /data/scratch/graphics/krita/work/.buildlink/include/boost/heap/fibonacci_heap.hpp:22:
/data/scratch/graphics/krita/work/.buildlink/include/boost/heap/detail/tree_iterator.hpp:61:58: warning: unused parameter 'cmp' [-Wunused-parameter]
    unordered_tree_iterator_storage(ValueCompare const & cmp)
                                                         ^
In file included from /data/scratch/graphics/krita/work/krita-4.2.9/libs/global/kis_latency_tracker.cpp:19:
In file included from /data/scratch/graphics/krita/work/krita-4.2.9/libs/global/kis_latency_tracker.h:31:
In file included from /data/scratch/graphics/krita/work/.buildlink/include/boost/accumulators/accumulators.hpp:12:
In file included from /data/scratch/graphics/krita/work/.buildlink/include/boost/accumulators/framework/accumulator_set.hpp:30:
In file included from /data/scratch/graphics/krita/work/.buildlink/include/boost/accumulators/framework/depends_on.hpp:13:
In file included from /data/scratch/graphics/krita/work/.buildlink/include/boost/mpl/map.hpp:36:
In file included from /data/scratch/graphics/krita/work/.buildlink/include/boost/mpl/map/map20.hpp:19:
In file included from /data/scratch/graphics/krita/work/.buildlink/include/boost/mpl/map/map10.hpp:19:
In file included from /data/scratch/graphics/krita/work/.buildlink/include/boost/mpl/map/map0.hpp:18:
In file included from /data/scratch/graphics/krita/work/.buildlink/include/boost/mpl/map/aux_/contains_impl.hpp:19:
In file included from /data/scratch/graphics/krita/work/.buildlink/include/boost/mpl/map/aux_/at_impl.hpp:21:
In file included from /data/scratch/graphics/krita/work/.buildlink/include/boost/mpl/aux_/order_impl.hpp:22:
In file included from /data/scratch/graphics/krita/work/.buildlink/include/boost/mpl/aux_/overload_names.hpp:18:
/data/scratch/graphics/krita/work/.buildlink/include/boost/mpl/aux_/config/operators.hpp:27:12: warning: '__NVCC___WORKAROUND_GUARD' is not defined, evaluates to 0 [-Wundef]
        || BOOST_WORKAROUND(__NVCC__, BOOST_TESTED_AT(1)) \
           ^
/data/scratch/graphics/krita/work/.buildlink/include/boost/config/workaround.hpp:246:10: note: expanded from macro 'BOOST_WORKAROUND'
       ((symbol ## _WORKAROUND_GUARD + 0 == 0) &&     \
         ^
<scratch space>:184:1: note: expanded from here
__NVCC___WORKAROUND_GUARD
^
In file included from /data/scratch/graphics/krita/work/krita-4.2.9/libs/global/kis_latency_tracker.cpp:19:
In file included from /data/scratch/graphics/krita/work/krita-4.2.9/libs/global/kis_latency_tracker.h:31:
In file included from /data/scratch/graphics/krita/work/.buildlink/include/boost/accumulators/accumulators.hpp:12:
In file included from /data/scratch/graphics/krita/work/.buildlink/include/boost/accumulators/framework/accumulator_set.hpp:30:
In file included from /data/scratch/graphics/krita/work/.buildlink/include/boost/accumulators/framework/depends_on.hpp:13:
In file included from /data/scratch/graphics/krita/work/.buildlink/include/boost/mpl/map.hpp:36:
In file included from /data/scratch/graphics/krita/work/.buildlink/include/boost/mpl/map/map20.hpp:19:
In file included from /data/scratch/graphics/krita/work/.buildlink/include/boost/mpl/map/map10.hpp:19:
In file included from /data/scratch/graphics/krita/work/.buildlink/include/boost/mpl/map/map0.hpp:18:
In file included from /data/scratch/graphics/krita/work/.buildlink/include/boost/mpl/map/aux_/contains_impl.hpp:19:
In file included from /data/scratch/graphics/krita/work/.buildlink/include/boost/mpl/map/aux_/at_impl.hpp:21:
In file included from /data/scratch/graphics/krita/work/.buildlink/include/boost/mpl/aux_/order_impl.hpp:22:
In file included from /data/scratch/graphics/krita/work/.buildlink/include/boost/mpl/aux_/overload_names.hpp:18:
/data/scratch/graphics/krita/work/.buildlink/include/boost/mpl/aux_/config/operators.hpp:27:29: warning: '__NVCC__' is not defined, evaluates to 0 [-Wundef]
        || BOOST_WORKAROUND(__NVCC__, BOOST_TESTED_AT(1)) \
                            ^
In file included from /data/scratch/graphics/krita/work/krita-4.2.9/libs/global/kis_algebra_2d.cpp:25:
In file included from /data/scratch/graphics/krita/work/.buildlink/include/boost/accumulators/accumulators.hpp:12:
/data/scratch/graphics/krita/work/.buildlink/include/boost/accumulators/framework/accumulator_set.hpp:64:30: warning: definition of implicit copy constructor for 'accumulator_visitor<boost::parameter::aux::flat_like_arg_list<boost::parameter::aux::flat_like_arg_tuple<boost::accumulators::tag::accumulator, boost::parameter::aux::tagged_argument<boost::accumulators::tag::accumulator, boost::accumulators::accumulator_set<double, boost::accumulators::stats<boost::accumulators::tag::min, boost::accumulators::tag::max, mpl_::na, mpl_::na, mpl_::na, mpl_::na, mpl_::na, mpl_::na, mpl_::na, mpl_::na, mpl_::na, mpl_::na, mpl_::na, mpl_::na, mpl_::na, mpl_::na, mpl_::na, mpl_::na, mpl_::na, mpl_::na>, void>>, std::__1::integral_constant<bool, true>>, boost::parameter::aux::flat_like_arg_tuple<boost::accumulators::tag::sample, boost::parameter::aux::tagged_argument<boost::accumulators::tag::sample, const int>, std::__1::integral_constant<bool, true>>>>' is deprecated because it has a user-declared copy assignment operator [-Wdeprecated-copy]
        accumulator_visitor &operator =(accumulator_visitor const &);
                             ^
/data/scratch/graphics/krita/work/.buildlink/include/boost/accumulators/framework/accumulator_set.hpp:71:16: note: in implicit copy constructor for 'boost::accumulators::detail::accumulator_visitor<boost::parameter::aux::flat_like_arg_list<boost::parameter::aux::flat_like_arg_tuple<boost::accumulators::tag::accumulator, boost::parameter::aux::tagged_argument<boost::accumulators::tag::accumulator, boost::accumulators::accumulator_set<double, boost::accumulators::stats<boost::accumulators::tag::min, boost::accumulators::tag::max, mpl_::na, mpl_::na, mpl_::na, mpl_::na, mpl_::na, mpl_::na, mpl_::na, mpl_::na, mpl_::na, mpl_::na, mpl_::na, mpl_::na, mpl_::na, mpl_::na, mpl_::na, mpl_::na, mpl_::na, mpl_::na>, void>>, std::__1::integral_constant<bool, true>>, boost::parameter::aux::flat_like_arg_tuple<boost::accumulators::tag::sample, boost::parameter::aux::tagged_argument<boost::accumulators::tag::sample, const int>, std::__1::integral_constant<bool, true>>>>' first required here
        return accumulator_visitor<Args>(args);
               ^
/data/scratch/graphics/krita/work/.buildlink/include/boost/accumulators/framework/accumulator_set.hpp:380:9: note: in instantiation of function template specialization 'boost::accumulators::detail::make_accumulator_visitor<boost::parameter::aux::flat_like_arg_list<boost::parameter::aux::flat_like_arg_tuple<boost::accumulators::tag::accumulator, boost::parameter::aux::tagged_argument<boost::accumulators::tag::accumulator, boost::accumulators::accumulator_set<double, boost::accumulators::stats<boost::accumulators::tag::min, boost::accumulators::tag::max, mpl_::na, mpl_::na, mpl_::na, mpl_::na, mpl_::na, mpl_::na, mpl_::na, mpl_::na, mpl_::na, mpl_::na, mpl_::na, mpl_::na, mpl_::na, mpl_::na, mpl_::na, mpl_::na, mpl_::na, mpl_::na>, void>>, std::__1::integral_constant<bool, true>>, boost::parameter::aux::flat_like_arg_tuple<boost::accumulators::tag::sample, boost::parameter::aux::tagged_argument<boost::accumulators::tag::sample, const int>, std::__1::integral_constant<bool, true>>>>' requested here
      , BOOST_ACCUMULATORS_ACCUMULATOR_SET_FUN_OP
        ^
/data/scratch/graphics/krita/work/.buildlink/include/boost/preprocessor/repetition/repeat_from_to.hpp:34:34: note: expanded from macro 'BOOST_PP_REPEAT_FROM_TO'
# define BOOST_PP_REPEAT_FROM_TO BOOST_PP_CAT(BOOST_PP_REPEAT_FROM_TO_, BOOST_PP_AUTO_REC(BOOST_PP_REPEAT_P, 4))
                                 ^
/data/scratch/graphics/krita/work/.buildlink/include/boost/preprocessor/cat.hpp:22:32: note: expanded from macro 'BOOST_PP_CAT'
#    define BOOST_PP_CAT(a, b) BOOST_PP_CAT_I(a, b)
                               ^
/data/scratch/graphics/krita/work/.buildlink/include/boost/preprocessor/cat.hpp:29:34: note: expanded from macro 'BOOST_PP_CAT_I'
#    define BOOST_PP_CAT_I(a, b) a ## b
                                 ^
<scratch space>:244:1: note: expanded from here
BOOST_PP_REPEAT_FROM_TO_1
^
/data/scratch/graphics/krita/work/krita-4.2.9/libs/global/kis_algebra_2d.cpp:261:13: note: in instantiation of function template specialization 'boost::accumulators::accumulator_set<double, boost::accumulators::stats<boost::accumulators::tag::min, boost::accumulators::tag::max, mpl_::na, mpl_::na, mpl_::na, mpl_::na, mpl_::na, mpl_::na, mpl_::na, mpl_::na, mpl_::na, mpl_::na, mpl_::na, mpl_::na, mpl_::na, mpl_::na, mpl_::na, mpl_::na, mpl_::na, mpl_::na>, void>::operator()<int>' requested here
            accX(pt.x());
            ^
/data/scratch/graphics/krita/work/krita-4.2.9/libs/global/kis_algebra_2d.cpp:280:16: note: in instantiation of function template specialization 'KisAlgebra2D::approximateRectFromPointsImpl<QRect, QPoint, true>' requested here
        return approximateRectFromPointsImpl<QRect, QPoint, true>(points);
               ^
In file included from /data/scratch/graphics/krita/work/krita-4.2.9/libs/global/kis_algebra_2d.cpp:25:
In file included from /data/scratch/graphics/krita/work/.buildlink/include/boost/accumulators/accumulators.hpp:12:
In file included from /data/scratch/graphics/krita/work/.buildlink/include/boost/accumulators/framework/accumulator_set.hpp:35:
/data/scratch/graphics/krita/work/.buildlink/include/boost/accumulators/framework/accumulators/droppable_accumulator.hpp:52:30: warning: definition of implicit copy constructor for 'add_ref_visitor<boost::parameter::aux::tagged_argument_list_of_1<boost::parameter::aux::tagged_argument<boost::accumulators::tag::accumulator, boost::accumulators::accumulator_set<double, boost::accumulators::stats<boost::accumulators::tag::min, boost::accumulators::tag::max, mpl_::na, mpl_::na, mpl_::na, mpl_::na, mpl_::na, mpl_::na, mpl_::na, mpl_::na, mpl_::na, mpl_::na, mpl_::na, mpl_::na, mpl_::na, mpl_::na, mpl_::na, mpl_::na, mpl_::na, mpl_::na>, void>>>>' is deprecated because it has a user-declared copy assignment operator [-Wdeprecated-copy]
            add_ref_visitor &operator =(add_ref_visitor const &);
                             ^
/data/scratch/graphics/krita/work/.buildlink/include/boost/accumulators/framework/accumulators/droppable_accumulator.hpp:59:20: note: in implicit copy constructor for 'boost::accumulators::detail::add_ref_visitor<boost::parameter::aux::tagged_argument_list_of_1<boost::parameter::aux::tagged_argument<boost::accumulators::tag::accumulator, boost::accumulators::accumulator_set<double, boost::accumulators::stats<boost::accumulators::tag::min, boost::accumulators::tag::max, mpl_::na, mpl_::na, mpl_::na, mpl_::na, mpl_::na, mpl_::na, mpl_::na, mpl_::na, mpl_::na, mpl_::na, mpl_::na, mpl_::na, mpl_::na, mpl_::na, mpl_::na, mpl_::na, mpl_::na, mpl_::na>, void>>>>' first required here
            return add_ref_visitor<Args>(args);
                   ^
/data/scratch/graphics/krita/work/.buildlink/include/boost/accumulators/framework/accumulator_set.hpp:176:21: note: in instantiation of function template specialization 'boost::accumulators::detail::make_add_ref_visitor<boost::parameter::aux::tagged_argument_list_of_1<boost::parameter::aux::tagged_argument<boost::accumulators::tag::accumulator, boost::accumulators::accumulator_set<double, boost::accumulators::stats<boost::accumulators::tag::min, boost::accumulators::tag::max, mpl_::na, mpl_::na, mpl_::na, mpl_::na, mpl_::na, mpl_::na, mpl_::na, mpl_::na, mpl_::na, mpl_::na, mpl_::na, mpl_::na, mpl_::na, mpl_::na, mpl_::na, mpl_::na, mpl_::na, mpl_::na>, void>>>>' requested here
            detail::make_add_ref_visitor(boost::accumulators::accumulator = *this)
                    ^
/data/scratch/graphics/krita/work/krita-4.2.9/libs/global/kis_algebra_2d.cpp:293:61: note: in instantiation of member function 'boost::accumulators::accumulator_set<double, boost::accumulators::stats<boost::accumulators::tag::min, boost::accumulators::tag::max, mpl_::na, mpl_::na, mpl_::na, mpl_::na, mpl_::na, mpl_::na, mpl_::na, mpl_::na, mpl_::na, mpl_::na, mpl_::na, mpl_::na, mpl_::na, mpl_::na, mpl_::na, mpl_::na, mpl_::na, mpl_::na>, void>::accumulator_set' requested here
        accumulator_set<qreal, stats<tag::min, tag::max > > accX;
                                                            ^
In file included from /data/scratch/graphics/krita/work/krita-4.2.9/libs/global/kis_algebra_2d.cpp:25:
In file included from /data/scratch/graphics/krita/work/.buildlink/include/boost/accumulators/accumulators.hpp:12:
/data/scratch/graphics/krita/work/.buildlink/include/boost/accumulators/framework/accumulator_set.hpp:64:30: warning: definition of implicit copy constructor for 'accumulator_visitor<boost::parameter::aux::flat_like_arg_list<boost::parameter::aux::flat_like_arg_tuple<boost::accumulators::tag::accumulator, boost::parameter::aux::tagged_argument<boost::accumulators::tag::accumulator, boost::accumulators::accumulator_set<double, boost::accumulators::stats<boost::accumulators::tag::min, boost::accumulators::tag::max, mpl_::na, mpl_::na, mpl_::na, mpl_::na, mpl_::na, mpl_::na, mpl_::na, mpl_::na, mpl_::na, mpl_::na, mpl_::na, mpl_::na, mpl_::na, mpl_::na, mpl_::na, mpl_::na, mpl_::na, mpl_::na>, void>>, std::__1::integral_constant<bool, true>>, boost::parameter::aux::flat_like_arg_tuple<boost::accumulators::tag::sample, boost::parameter::aux::tagged_argument<boost::accumulators::tag::sample, const double>, std::__1::integral_constant<bool, true>>>>' is deprecated because it has a user-declared copy assignment operator [-Wdeprecated-copy]
        accumulator_visitor &operator =(accumulator_visitor const &);
                             ^
/data/scratch/graphics/krita/work/.buildlink/include/boost/accumulators/framework/accumulator_set.hpp:71:16: note: in implicit copy constructor for 'boost::accumulators::detail::accumulator_visitor<boost::parameter::aux::flat_like_arg_list<boost::parameter::aux::flat_like_arg_tuple<boost::accumulators::tag::accumulator, boost::parameter::aux::tagged_argument<boost::accumulators::tag::accumulator, boost::accumulators::accumulator_set<double, boost::accumulators::stats<boost::accumulators::tag::min, boost::accumulators::tag::max, mpl_::na, mpl_::na, mpl_::na, mpl_::na, mpl_::na, mpl_::na, mpl_::na, mpl_::na, mpl_::na, mpl_::na, mpl_::na, mpl_::na, mpl_::na, mpl_::na, mpl_::na, mpl_::na, mpl_::na, mpl_::na>, void>>, std::__1::integral_constant<bool, true>>, boost::parameter::aux::flat_like_arg_tuple<boost::accumulators::tag::sample, boost::parameter::aux::tagged_argument<boost::accumulators::tag::sample, const double>, std::__1::integral_constant<bool, true>>>>' first required here
        return accumulator_visitor<Args>(args);
               ^
/data/scratch/graphics/krita/work/.buildlink/include/boost/accumulators/framework/accumulator_set.hpp:380:9: note: in instantiation of function template specialization 'boost::accumulators::detail::make_accumulator_visitor<boost::parameter::aux::flat_like_arg_list<boost::parameter::aux::flat_like_arg_tuple<boost::accumulators::tag::accumulator, boost::parameter::aux::tagged_argument<boost::accumulators::tag::accumulator, boost::accumulators::accumulator_set<double, boost::accumulators::stats<boost::accumulators::tag::min, boost::accumulators::tag::max, mpl_::na, mpl_::na, mpl_::na, mpl_::na, mpl_::na, mpl_::na, mpl_::na, mpl_::na, mpl_::na, mpl_::na, mpl_::na, mpl_::na, mpl_::na, mpl_::na, mpl_::na, mpl_::na, mpl_::na, mpl_::na>, void>>, std::__1::integral_constant<bool, true>>, boost::parameter::aux::flat_like_arg_tuple<boost::accumulators::tag::sample, boost::parameter::aux::tagged_argument<boost::accumulators::tag::sample, const double>, std::__1::integral_constant<bool, true>>>>' requested here
      , BOOST_ACCUMULATORS_ACCUMULATOR_SET_FUN_OP
        ^
/data/scratch/graphics/krita/work/.buildlink/include/boost/preprocessor/repetition/repeat_from_to.hpp:34:34: note: expanded from macro 'BOOST_PP_REPEAT_FROM_TO'
# define BOOST_PP_REPEAT_FROM_TO BOOST_PP_CAT(BOOST_PP_REPEAT_FROM_TO_, BOOST_PP_AUTO_REC(BOOST_PP_REPEAT_P, 4))
                                 ^
/data/scratch/graphics/krita/work/.buildlink/include/boost/preprocessor/cat.hpp:22:32: note: expanded from macro 'BOOST_PP_CAT'
#    define BOOST_PP_CAT(a, b) BOOST_PP_CAT_I(a, b)
                               ^
/data/scratch/graphics/krita/work/.buildlink/include/boost/preprocessor/cat.hpp:29:34: note: expanded from macro 'BOOST_PP_CAT_I'
#    define BOOST_PP_CAT_I(a, b) a ## b
                                 ^
<scratch space>:244:1: note: expanded from here
BOOST_PP_REPEAT_FROM_TO_1
^
/data/scratch/graphics/krita/work/krita-4.2.9/libs/global/kis_algebra_2d.cpp:299:17: note: in instantiation of function template specialization 'boost::accumulators::accumulator_set<double, boost::accumulators::stats<boost::accumulators::tag::min, boost::accumulators::tag::max, mpl_::na, mpl_::na, mpl_::na, mpl_::na, mpl_::na, mpl_::na, mpl_::na, mpl_::na, mpl_::na, mpl_::na, mpl_::na, mpl_::na, mpl_::na, mpl_::na, mpl_::na, mpl_::na, mpl_::na, mpl_::na>, void>::operator()<double>' requested here
            accX(dstPt.x());
                ^
In file included from /data/scratch/graphics/krita/work/krita-4.2.9/libs/global/kis_latency_tracker.cpp:19:
In file included from /data/scratch/graphics/krita/work/krita-4.2.9/libs/global/kis_latency_tracker.h:33:
In file included from /data/scratch/graphics/krita/work/.buildlink/include/boost/accumulators/statistics/rolling_mean.hpp:19:
In file included from /data/scratch/graphics/krita/work/.buildlink/include/boost/accumulators/statistics/rolling_sum.hpp:18:
/data/scratch/graphics/krita/work/.buildlink/include/boost/accumulators/statistics/rolling_window.hpp:126:57: warning: unused parameter 'version' [-Wunused-parameter]
        void serialize(Archive & ar, const unsigned int version)
                                                        ^
/data/scratch/graphics/krita/work/.buildlink/include/boost/accumulators/statistics/rolling_window.hpp:163:34: warning: unused parameter 'ar' [-Wunused-parameter]
        void serialize(Archive & ar, const unsigned int file_version) {}
                                 ^
/data/scratch/graphics/krita/work/.buildlink/include/boost/accumulators/statistics/rolling_window.hpp:163:57: warning: unused parameter 'file_version' [-Wunused-parameter]
        void serialize(Archive & ar, const unsigned int file_version) {}
                                                        ^
In file included from /data/scratch/graphics/krita/work/krita-4.2.9/libs/global/kis_latency_tracker.cpp:19:
In file included from /data/scratch/graphics/krita/work/krita-4.2.9/libs/global/kis_latency_tracker.h:33:
In file included from /data/scratch/graphics/krita/work/.buildlink/include/boost/accumulators/statistics/rolling_mean.hpp:19:
/data/scratch/graphics/krita/work/.buildlink/include/boost/accumulators/statistics/rolling_sum.hpp:56:57: warning: unused parameter 'file_version' [-Wunused-parameter]
        void serialize(Archive & ar, const unsigned int file_version)
                                                        ^
In file included from /data/scratch/graphics/krita/work/krita-4.2.9/libs/global/kis_latency_tracker.cpp:19:
In file included from /data/scratch/graphics/krita/work/krita-4.2.9/libs/global/kis_latency_tracker.h:33:
In file included from /data/scratch/graphics/krita/work/.buildlink/include/boost/accumulators/statistics/rolling_mean.hpp:20:
/data/scratch/graphics/krita/work/.buildlink/include/boost/accumulators/statistics/rolling_count.hpp:46:34: warning: unused parameter 'ar' [-Wunused-parameter]
        void serialize(Archive & ar, const unsigned int file_version) {}
                                 ^
/data/scratch/graphics/krita/work/.buildlink/include/boost/accumulators/statistics/rolling_count.hpp:46:57: warning: unused parameter 'file_version' [-Wunused-parameter]
        void serialize(Archive & ar, const unsigned int file_version) {}
                                                        ^
In file included from /data/scratch/graphics/krita/work/krita-4.2.9/libs/global/kis_latency_tracker.cpp:19:
In file included from /data/scratch/graphics/krita/work/krita-4.2.9/libs/global/kis_latency_tracker.h:33:
/data/scratch/graphics/krita/work/.buildlink/include/boost/accumulators/statistics/rolling_mean.hpp:49:35: warning: unused parameter 'ar' [-Wunused-parameter]
         void serialize(Archive & ar, const unsigned int file_version) {}
                                  ^
/data/scratch/graphics/krita/work/.buildlink/include/boost/accumulators/statistics/rolling_mean.hpp:49:58: warning: unused parameter 'file_version' [-Wunused-parameter]
         void serialize(Archive & ar, const unsigned int file_version) {}
                                                         ^
/data/scratch/graphics/krita/work/.buildlink/include/boost/accumulators/statistics/rolling_mean.hpp:97:58: warning: unused parameter 'file_version' [-Wunused-parameter]
         void serialize(Archive & ar, const unsigned int file_version)
                                                         ^
8 warnings generated.
In file included from /data/scratch/graphics/krita/work/krita-4.2.9/libs/global/kis_latency_tracker.cpp:19:
In file included from /data/scratch/graphics/krita/work/krita-4.2.9/libs/global/kis_latency_tracker.h:34:
In file included from /data/scratch/graphics/krita/work/.buildlink/include/boost/accumulators/statistics/rolling_variance.hpp:23:
In file included from /data/scratch/graphics/krita/work/.buildlink/include/boost/accumulators/statistics/rolling_moment.hpp:22:
In file included from /data/scratch/graphics/krita/work/.buildlink/include/boost/accumulators/statistics/moment.hpp:21:
/data/scratch/graphics/krita/work/.buildlink/include/boost/accumulators/statistics/count.hpp:48:57: warning: unused parameter 'file_version' [-Wunused-parameter]
        void serialize(Archive & ar, const unsigned int file_version)
                                                        ^
In file included from /data/scratch/graphics/krita/work/krita-4.2.9/libs/global/kis_latency_tracker.cpp:19:
In file included from /data/scratch/graphics/krita/work/krita-4.2.9/libs/global/kis_latency_tracker.h:34:
In file included from /data/scratch/graphics/krita/work/.buildlink/include/boost/accumulators/statistics/rolling_variance.hpp:23:
In file included from /data/scratch/graphics/krita/work/.buildlink/include/boost/accumulators/statistics/rolling_moment.hpp:22:
/data/scratch/graphics/krita/work/.buildlink/include/boost/accumulators/statistics/moment.hpp:80:57: warning: unused parameter 'file_version' [-Wunused-parameter]
        void serialize(Archive & ar, const unsigned int file_version)
                                                        ^
In file included from /data/scratch/graphics/krita/work/krita-4.2.9/libs/global/kis_latency_tracker.cpp:19:
In file included from /data/scratch/graphics/krita/work/krita-4.2.9/libs/global/kis_latency_tracker.h:34:
In file included from /data/scratch/graphics/krita/work/.buildlink/include/boost/accumulators/statistics/rolling_variance.hpp:23:
/data/scratch/graphics/krita/work/.buildlink/include/boost/accumulators/statistics/rolling_moment.hpp:63:57: warning: unused parameter 'file_version' [-Wunused-parameter]
        void serialize(Archive & ar, const unsigned int file_version)
                                                        ^
In file included from /data/scratch/graphics/krita/work/krita-4.2.9/libs/global/kis_latency_tracker.cpp:19:
In file included from /data/scratch/graphics/krita/work/krita-4.2.9/libs/global/kis_latency_tracker.h:34:
/data/scratch/graphics/krita/work/.buildlink/include/boost/accumulators/statistics/rolling_variance.hpp:68:34: warning: unused parameter 'ar' [-Wunused-parameter]
        void serialize(Archive & ar, const unsigned int file_version) {}
                                 ^
/data/scratch/graphics/krita/work/.buildlink/include/boost/accumulators/statistics/rolling_variance.hpp:68:57: warning: unused parameter 'file_version' [-Wunused-parameter]
        void serialize(Archive & ar, const unsigned int file_version) {}
                                                        ^
/data/scratch/graphics/krita/work/.buildlink/include/boost/accumulators/statistics/rolling_variance.hpp:148:57: warning: unused parameter 'file_version' [-Wunused-parameter]
        void serialize(Archive & ar, const unsigned int file_version)
                                                        ^
/data/scratch/graphics/krita/work/.buildlink/include/boost/accumulators/statistics/rolling_variance.hpp:165:35: warning: unused parameter 'non_arithmetic_quantity' [-Wunused-parameter]
        void prevent_underflow(T &non_arithmetic_quantity,typename boost::disable_if<boost::is_arithmetic<T>,T>::type* = 0)
                                  ^
In file included from /data/scratch/graphics/krita/work/krita-4.2.9/libs/global/kis_latency_tracker.cpp:19:
In file included from /data/scratch/graphics/krita/work/krita-4.2.9/libs/global/kis_latency_tracker.h:33:
In file included from /data/scratch/graphics/krita/work/.buildlink/include/boost/accumulators/statistics/rolling_mean.hpp:19:
In file included from /data/scratch/graphics/krita/work/.buildlink/include/boost/accumulators/statistics/rolling_sum.hpp:18:
In file included from /data/scratch/graphics/krita/work/.buildlink/include/boost/accumulators/statistics/rolling_window.hpp:14:
In file included from /data/scratch/graphics/krita/work/.buildlink/include/boost/circular_buffer.hpp:57:
/data/scratch/graphics/krita/work/.buildlink/include/boost/circular_buffer/details.hpp:262:15: warning: definition of implicit copy constructor for 'iterator<boost::circular_buffer<long long, std::__1::allocator<long long>>, boost::cb_details::const_traits<std::__1::allocator_traits<std::__1::allocator<long long>>>>' is deprecated because it has a user-declared copy assignment operator [-Wdeprecated-copy]
    iterator& operator = (const iterator& it) {
              ^
/data/scratch/graphics/krita/work/.buildlink/include/boost/circular_buffer/base.hpp:1105:53: note: in implicit copy constructor for 'boost::cb_details::iterator<boost::circular_buffer<long long, std::__1::allocator<long long>>, boost::cb_details::const_traits<std::__1::allocator_traits<std::__1::allocator<long long>>>>' first required here
            m_last = cb_details::uninitialized_copy(cb.begin(), cb.end(), m_buff, alloc());
                                                    ^
/data/scratch/graphics/krita/work/.buildlink/include/boost/accumulators/statistics/rolling_window.hpp:80:12: note: in instantiation of member function 'boost::circular_buffer<long long, std::__1::allocator<long long>>::circular_buffer' requested here
    struct rolling_window_plus1_impl
           ^
/data/scratch/graphics/krita/work/.buildlink/include/boost/fusion/container/list/cons.hpp:79:15: note: in instantiation of member function 'boost::accumulators::detail::accumulator_wrapper<boost::accumulators::impl::rolling_window_plus1_impl<long long>, boost::accumulators::tag::rolling_window_plus1>::accumulator_wrapper' requested here
            : car(rhs.car), cdr(rhs.cdr) {}
              ^
/data/scratch/graphics/krita/work/krita-4.2.9/libs/global/kis_latency_tracker.h:80:9: note: in instantiation of function template specialization 'boost::accumulators::accumulator_set<long long, boost::accumulators::stats<boost::accumulators::tag::lazy_rolling_mean, boost::accumulators::tag::rolling_variance, mpl_::na, mpl_::na, mpl_::na, mpl_::na, mpl_::na, mpl_::na, mpl_::na, mpl_::na, mpl_::na, mpl_::na, mpl_::na, mpl_::na, mpl_::na, mpl_::na, mpl_::na, mpl_::na, mpl_::na, mpl_::na>, void>::accumulator_set<boost::parameter::aux::tagged_argument_list_of_1<boost::parameter::aux::tagged_argument<boost::accumulators::tag::rolling_window_size_<0>, int>>>' requested here
        m_acc(boost::accumulators::tag::rolling_window::window_size = windowSize)
        ^
/data/scratch/graphics/krita/work/krita-4.2.9/libs/global/kis_latency_tracker.cpp:22:5: note: in instantiation of member function 'KisScalarTracker<long long>::KisScalarTracker' requested here
    KisScalarTracker<qint64>("event latency", windowSize)
    ^
In file included from /data/scratch/graphics/krita/work/krita-4.2.9/libs/global/kis_latency_tracker.cpp:19:
In file included from /data/scratch/graphics/krita/work/krita-4.2.9/libs/global/kis_latency_tracker.h:31:
In file included from /data/scratch/graphics/krita/work/.buildlink/include/boost/accumulators/accumulators.hpp:12:
In file included from /data/scratch/graphics/krita/work/.buildlink/include/boost/accumulators/framework/accumulator_set.hpp:35:
/data/scratch/graphics/krita/work/.buildlink/include/boost/accumulators/framework/accumulators/droppable_accumulator.hpp:52:30: warning: definition of implicit copy constructor for 'add_ref_visitor<boost::parameter::aux::tagged_argument_list_of_1<boost::parameter::aux::tagged_argument<boost::accumulators::tag::accumulator, boost::accumulators::accumulator_set<long long, boost::accumulators::stats<boost::accumulators::tag::lazy_rolling_mean, boost::accumulators::tag::rolling_variance, mpl_::na, mpl_::na, mpl_::na, mpl_::na, mpl_::na, mpl_::na, mpl_::na, mpl_::na, mpl_::na, mpl_::na, mpl_::na, mpl_::na, mpl_::na, mpl_::na, mpl_::na, mpl_::na, mpl_::na, mpl_::na>, void>>>>' is deprecated because it has a user-declared copy assignment operator [-Wdeprecated-copy]
            add_ref_visitor &operator =(add_ref_visitor const &);
                             ^
/data/scratch/graphics/krita/work/.buildlink/include/boost/accumulators/framework/accumulators/droppable_accumulator.hpp:59:20: note: in implicit copy constructor for 'boost::accumulators::detail::add_ref_visitor<boost::parameter::aux::tagged_argument_list_of_1<boost::parameter::aux::tagged_argument<boost::accumulators::tag::accumulator, boost::accumulators::accumulator_set<long long, boost::accumulators::stats<boost::accumulators::tag::lazy_rolling_mean, boost::accumulators::tag::rolling_variance, mpl_::na, mpl_::na, mpl_::na, mpl_::na, mpl_::na, mpl_::na, mpl_::na, mpl_::na, mpl_::na, mpl_::na, mpl_::na, mpl_::na, mpl_::na, mpl_::na, mpl_::na, mpl_::na, mpl_::na, mpl_::na>, void>>>>' first required here
            return add_ref_visitor<Args>(args);
                   ^
/data/scratch/graphics/krita/work/.buildlink/include/boost/accumulators/framework/accumulator_set.hpp:199:21: note: in instantiation of function template specialization 'boost::accumulators::detail::make_add_ref_visitor<boost::parameter::aux::tagged_argument_list_of_1<boost::parameter::aux::tagged_argument<boost::accumulators::tag::accumulator, boost::accumulators::accumulator_set<long long, boost::accumulators::stats<boost::accumulators::tag::lazy_rolling_mean, boost::accumulators::tag::rolling_variance, mpl_::na, mpl_::na, mpl_::na, mpl_::na, mpl_::na, mpl_::na, mpl_::na, mpl_::na, mpl_::na, mpl_::na, mpl_::na, mpl_::na, mpl_::na, mpl_::na, mpl_::na, mpl_::na, mpl_::na, mpl_::na>, void>>>>' requested here
            detail::make_add_ref_visitor(boost::accumulators::accumulator = *this)
                    ^
/data/scratch/graphics/krita/work/krita-4.2.9/libs/global/kis_latency_tracker.h:80:9: note: in instantiation of function template specialization 'boost::accumulators::accumulator_set<long long, boost::accumulators::stats<boost::accumulators::tag::lazy_rolling_mean, boost::accumulators::tag::rolling_variance, mpl_::na, mpl_::na, mpl_::na, mpl_::na, mpl_::na, mpl_::na, mpl_::na, mpl_::na, mpl_::na, mpl_::na, mpl_::na, mpl_::na, mpl_::na, mpl_::na, mpl_::na, mpl_::na, mpl_::na, mpl_::na>, void>::accumulator_set<boost::parameter::aux::tagged_argument_list_of_1<boost::parameter::aux::tagged_argument<boost::accumulators::tag::rolling_window_size_<0>, int>>>' requested here
        m_acc(boost::accumulators::tag::rolling_window::window_size = windowSize)
        ^
/data/scratch/graphics/krita/work/krita-4.2.9/libs/global/kis_latency_tracker.cpp:22:5: note: in instantiation of member function 'KisScalarTracker<long long>::KisScalarTracker' requested here
    KisScalarTracker<qint64>("event latency", windowSize)
    ^
In file included from /data/scratch/graphics/krita/work/krita-4.2.9/libs/global/kis_latency_tracker.cpp:19:
In file included from /data/scratch/graphics/krita/work/krita-4.2.9/libs/global/kis_latency_tracker.h:31:
In file included from /data/scratch/graphics/krita/work/.buildlink/include/boost/accumulators/accumulators.hpp:12:
/data/scratch/graphics/krita/work/.buildlink/include/boost/accumulators/framework/accumulator_set.hpp:64:30: warning: definition of implicit copy constructor for 'accumulator_visitor<boost::parameter::aux::flat_like_arg_list<boost::parameter::aux::flat_like_arg_tuple<boost::accumulators::tag::accumulator, boost::parameter::aux::tagged_argument<boost::accumulators::tag::accumulator, boost::accumulators::accumulator_set<long long, boost::accumulators::stats<boost::accumulators::tag::lazy_rolling_mean, boost::accumulators::tag::rolling_variance, mpl_::na, mpl_::na, mpl_::na, mpl_::na, mpl_::na, mpl_::na, mpl_::na, mpl_::na, mpl_::na, mpl_::na, mpl_::na, mpl_::na, mpl_::na, mpl_::na, mpl_::na, mpl_::na, mpl_::na, mpl_::na>, void>>, std::__1::integral_constant<bool, true>>, boost::parameter::aux::flat_like_arg_tuple<boost::accumulators::tag::sample, boost::parameter::aux::tagged_argument<boost::accumulators::tag::sample, const long long>, std::__1::integral_constant<bool, true>>>>' is deprecated because it has a user-declared copy assignment operator [-Wdeprecated-copy]
        accumulator_visitor &operator =(accumulator_visitor const &);
                             ^
/data/scratch/graphics/krita/work/.buildlink/include/boost/accumulators/framework/accumulator_set.hpp:71:16: note: in implicit copy constructor for 'boost::accumulators::detail::accumulator_visitor<boost::parameter::aux::flat_like_arg_list<boost::parameter::aux::flat_like_arg_tuple<boost::accumulators::tag::accumulator, boost::parameter::aux::tagged_argument<boost::accumulators::tag::accumulator, boost::accumulators::accumulator_set<long long, boost::accumulators::stats<boost::accumulators::tag::lazy_rolling_mean, boost::accumulators::tag::rolling_variance, mpl_::na, mpl_::na, mpl_::na, mpl_::na, mpl_::na, mpl_::na, mpl_::na, mpl_::na, mpl_::na, mpl_::na, mpl_::na, mpl_::na, mpl_::na, mpl_::na, mpl_::na, mpl_::na, mpl_::na, mpl_::na>, void>>, std::__1::integral_constant<bool, true>>, boost::parameter::aux::flat_like_arg_tuple<boost::accumulators::tag::sample, boost::parameter::aux::tagged_argument<boost::accumulators::tag::sample, const long long>, std::__1::integral_constant<bool, true>>>>' first required here
        return accumulator_visitor<Args>(args);
               ^
/data/scratch/graphics/krita/work/.buildlink/include/boost/accumulators/framework/accumulator_set.hpp:380:9: note: in instantiation of function template specialization 'boost::accumulators::detail::make_accumulator_visitor<boost::parameter::aux::flat_like_arg_list<boost::parameter::aux::flat_like_arg_tuple<boost::accumulators::tag::accumulator, boost::parameter::aux::tagged_argument<boost::accumulators::tag::accumulator, boost::accumulators::accumulator_set<long long, boost::accumulators::stats<boost::accumulators::tag::lazy_rolling_mean, boost::accumulators::tag::rolling_variance, mpl_::na, mpl_::na, mpl_::na, mpl_::na, mpl_::na, mpl_::na, mpl_::na, mpl_::na, mpl_::na, mpl_::na, mpl_::na, mpl_::na, mpl_::na, mpl_::na, mpl_::na, mpl_::na, mpl_::na, mpl_::na>, void>>, std::__1::integral_constant<bool, true>>, boost::parameter::aux::flat_like_arg_tuple<boost::accumulators::tag::sample, boost::parameter::aux::tagged_argument<boost::accumulators::tag::sample, const long long>, std::__1::integral_constant<bool, true>>>>' requested here
      , BOOST_ACCUMULATORS_ACCUMULATOR_SET_FUN_OP
        ^
/data/scratch/graphics/krita/work/.buildlink/include/boost/preprocessor/repetition/repeat_from_to.hpp:34:34: note: expanded from macro 'BOOST_PP_REPEAT_FROM_TO'
# define BOOST_PP_REPEAT_FROM_TO BOOST_PP_CAT(BOOST_PP_REPEAT_FROM_TO_, BOOST_PP_AUTO_REC(BOOST_PP_REPEAT_P, 4))
                                 ^
/data/scratch/graphics/krita/work/.buildlink/include/boost/preprocessor/cat.hpp:22:32: note: expanded from macro 'BOOST_PP_CAT'
#    define BOOST_PP_CAT(a, b) BOOST_PP_CAT_I(a, b)
                               ^
/data/scratch/graphics/krita/work/.buildlink/include/boost/preprocessor/cat.hpp:29:34: note: expanded from macro 'BOOST_PP_CAT_I'
#    define BOOST_PP_CAT_I(a, b) a ## b
                                 ^
<scratch space>:92:1: note: expanded from here
BOOST_PP_REPEAT_FROM_TO_1
^
/data/scratch/graphics/krita/work/krita-4.2.9/libs/global/kis_latency_tracker.h:94:9: note: in instantiation of function template specialization 'boost::accumulators::accumulator_set<long long, boost::accumulators::stats<boost::accumulators::tag::lazy_rolling_mean, boost::accumulators::tag::rolling_variance, mpl_::na, mpl_::na, mpl_::na, mpl_::na, mpl_::na, mpl_::na, mpl_::na, mpl_::na, mpl_::na, mpl_::na, mpl_::na, mpl_::na, mpl_::na, mpl_::na, mpl_::na, mpl_::na, mpl_::na, mpl_::na>, void>::operator()<long long>' requested here
        m_acc(value);
        ^
/data/scratch/graphics/krita/work/krita-4.2.9/libs/global/kis_latency_tracker.cpp:29:31: note: in instantiation of member function 'KisScalarTracker<long long>::push' requested here
    KisScalarTracker<qint64>::push(latency);
                              ^
30 warnings generated.
gmake[1]: *** [CMakeFiles/Makefile2:7317: libs/global/CMakeFiles/kritaglobal.dir/all] Error 2
gmake: *** [Makefile:161: all] Error 2
*** Error code 2

Stop.
make[1]: stopped in /data/pkgsrc/graphics/krita
*** Error code 1

Stop.
make: stopped in /data/pkgsrc/graphics/krita