=> Bootstrap dependency digest>=20010302: found digest-20190127
===> Skipping vulnerability checks.
WARNING: No /var/db/pkg/pkg-vulnerabilities file found.
WARNING: To fix run: `/usr/sbin/pkg_admin -K /var/db/pkg fetch-pkg-vulnerabilities'.
===> Skipping vulnerability checks.
WARNING: No /var/db/pkg/pkg-vulnerabilities file found.
WARNING: To fix run: `/usr/sbin/pkg_admin -K /var/db/pkg fetch-pkg-vulnerabilities'.
===> Building for corebird-1.7.3nb21
/usr/pkg/bin/gmake  all-recursive
gmake[1]: Entering directory '/data/scratch/net/corebird/work/corebird-1.7.3'
Making all in src
gmake[2]: Entering directory '/data/scratch/net/corebird/work/corebird-1.7.3/src'
XMLLINT=/usr/pkg/bin/xmllint /usr/pkg/bin/glib-compile-resources --target corebird-resources.c --generate --sourcedir=.. --c-name corebird ../corebird.gresource.xml
DefaultTimeline.vala:50.3-50.24: error: Creation method of abstract class cannot be public.
  public DefaultTimeline (int id) {
  ^^^^^^^^^^^^^^^^^^^^^^
Command-line option `--thread` is deprecated and will be ignored
Compilation failed: 1 error(s), 0 warning(s)
gmake[2]: *** [Makefile:1305: libcorebird_la_vala.stamp] Error 1
gmake[2]: Leaving directory '/data/scratch/net/corebird/work/corebird-1.7.3/src'
gmake[1]: *** [Makefile:451: all-recursive] Error 1
gmake[1]: Leaving directory '/data/scratch/net/corebird/work/corebird-1.7.3'
gmake: *** [Makefile:383: all] Error 2
*** Error code 2

Stop.
make[1]: stopped in /data/pkgsrc/net/corebird
*** Error code 1

Stop.
make: stopped in /data/pkgsrc/net/corebird