=> Bootstrap dependency digest>=20010302: found digest-20190127
===> Skipping vulnerability checks.
WARNING: No /var/db/pkg/pkg-vulnerabilities file found.
WARNING: To fix run: `/usr/sbin/pkg_admin -K /var/db/pkg fetch-pkg-vulnerabilities'.
===> Skipping vulnerability checks.
WARNING: No /var/db/pkg/pkg-vulnerabilities file found.
WARNING: To fix run: `/usr/sbin/pkg_admin -K /var/db/pkg fetch-pkg-vulnerabilities'.
===> Building for labltk-8.06.3nb5
cd support; /usr/pkg/bin/gmake
gmake[1]: Entering directory '/data/scratch/x11/labltk/work/labltk-8.06.3/support'
/usr/pkg/bin/ocamlc.opt -c -warn-error A-3  support.mli
/usr/pkg/bin/ocamlc.opt -c -warn-error A-3  support.ml
/usr/pkg/bin/ocamlc.opt -c -warn-error A-3  rawwidget.mli
/usr/pkg/bin/ocamlc.opt -c -warn-error A-3  rawwidget.ml
/usr/pkg/bin/ocamlc.opt -c -warn-error A-3  widget.mli
/usr/pkg/bin/ocamlc.opt -c -warn-error A-3  widget.ml
/usr/pkg/bin/ocamlc.opt -c -warn-error A-3  protocol.mli
/usr/pkg/bin/ocamlc.opt -c -warn-error A-3  protocol.ml
/usr/pkg/bin/ocamlc.opt -c -warn-error A-3  textvariable.mli
/usr/pkg/bin/ocamlc.opt -c -warn-error A-3  textvariable.ml
/usr/pkg/bin/ocamlc.opt -c -warn-error A-3  timer.mli
/usr/pkg/bin/ocamlc.opt -c -warn-error A-3  timer.ml
/usr/pkg/bin/ocamlc.opt -c -warn-error A-3  fileevent.mli
/usr/pkg/bin/ocamlc.opt -c -warn-error A-3  fileevent.ml
/usr/pkg/bin/ocamlc.opt -c -warn-error A-3  camltkwrap.mli
/usr/pkg/bin/ocamlc.opt -c -warn-error A-3  camltkwrap.ml
/usr/pkg/bin/ocamlc.opt -c -warn-error A-3  -I +threads -I vmthreads tkthread.mli
/usr/pkg/bin/ocamlc.opt -c -warn-error A-3  -I +threads -I vmthreads tkthread.ml
I/usr/pkg/lib/ocaml/caml   -c cltkCaml.c
gmake[1]: I/usr/pkg/lib/ocaml/caml: Command not found
gmake[1]: [Makefile:88: cltkCaml.o] Error 127 (ignored)
I/usr/pkg/lib/ocaml/caml   -c cltkUtf.c
gmake[1]: I/usr/pkg/lib/ocaml/caml: Command not found
gmake[1]: [Makefile:88: cltkUtf.o] Error 127 (ignored)
I/usr/pkg/lib/ocaml/caml   -c cltkEval.c
gmake[1]: I/usr/pkg/lib/ocaml/caml: Command not found
gmake[1]: [Makefile:88: cltkEval.o] Error 127 (ignored)
I/usr/pkg/lib/ocaml/caml   -c cltkEvent.c
gmake[1]: I/usr/pkg/lib/ocaml/caml: Command not found
gmake[1]: [Makefile:88: cltkEvent.o] Error 127 (ignored)
I/usr/pkg/lib/ocaml/caml   -c cltkFile.c
gmake[1]: I/usr/pkg/lib/ocaml/caml: Command not found
gmake[1]: [Makefile:88: cltkFile.o] Error 127 (ignored)
I/usr/pkg/lib/ocaml/caml   -c cltkMain.c
gmake[1]: I/usr/pkg/lib/ocaml/caml: Command not found
gmake[1]: [Makefile:88: cltkMain.o] Error 127 (ignored)
I/usr/pkg/lib/ocaml/caml   -c cltkMisc.c
gmake[1]: I/usr/pkg/lib/ocaml/caml: Command not found
gmake[1]: [Makefile:88: cltkMisc.o] Error 127 (ignored)
I/usr/pkg/lib/ocaml/caml   -c cltkTimer.c
gmake[1]: I/usr/pkg/lib/ocaml/caml: Command not found
gmake[1]: [Makefile:88: cltkTimer.o] Error 127 (ignored)
I/usr/pkg/lib/ocaml/caml   -c cltkVar.c
gmake[1]: I/usr/pkg/lib/ocaml/caml: Command not found
gmake[1]: [Makefile:88: cltkVar.o] Error 127 (ignored)
I/usr/pkg/lib/ocaml/caml   -c cltkWait.c
gmake[1]: I/usr/pkg/lib/ocaml/caml: Command not found
gmake[1]: [Makefile:88: cltkWait.o] Error 127 (ignored)
I/usr/pkg/lib/ocaml/caml   -c cltkImg.c
gmake[1]: I/usr/pkg/lib/ocaml/caml: Command not found
gmake[1]: [Makefile:88: cltkImg.o] Error 127 (ignored)
/usr/pkg/bin/ocamlmklib -o labltk cltkCaml.o cltkUtf.o cltkEval.o cltkEvent.o cltkFile.o cltkMain.o cltkMisc.o cltkTimer.o cltkVar.o cltkWait.o cltkImg.o 
clang: error: no such file or directory: 'cltkCaml.o'
clang: error: no such file or directory: 'cltkUtf.o'
clang: error: no such file or directory: 'cltkEval.o'
clang: error: no such file or directory: 'cltkEvent.o'
clang: error: no such file or directory: 'cltkFile.o'
clang: error: no such file or directory: 'cltkMain.o'
clang: error: no such file or directory: 'cltkMisc.o'
clang: error: no such file or directory: 'cltkTimer.o'
clang: error: no such file or directory: 'cltkVar.o'
clang: error: no such file or directory: 'cltkWait.o'
clang: error: no such file or directory: 'cltkImg.o'
clang: error: no input files
gmake[1]: *** [Makefile:38: liblabltk.a] Error 2
gmake[1]: Leaving directory '/data/scratch/x11/labltk/work/labltk-8.06.3/support'
gmake: *** [Makefile:25: all] Error 2
*** Error code 2

Stop.
make[1]: stopped in /data/pkgsrc/x11/labltk
*** Error code 1

Stop.
make: stopped in /data/pkgsrc/x11/labltk