=> Bootstrap dependency digest>=20010302: found digest-20190127
===> Skipping vulnerability checks.
WARNING: No /var/db/pkg/pkg-vulnerabilities file found.
WARNING: To fix run: `/usr/sbin/pkg_admin -K /var/db/pkg fetch-pkg-vulnerabilities'.
===> Building for creduce-2.10.0nb1
/usr/pkg/bin/gmake  all-recursive
gmake[1]: Entering directory '/data/scratch/devel/creduce/work/creduce-2.10.0'
Making all in clang_delta
gmake[2]: Entering directory '/data/scratch/devel/creduce/work/creduce-2.10.0/clang_delta'
clang++ -DHAVE_CONFIG_H -I. -I..   -I"/usr/pkg/include/clang" -I/usr/pkg/include -I/usr/include -I/usr/pkg/include -std=c++14 -fno-exceptions -D__STDC_CONSTANT_MACROS -D__STDC_FORMAT_MACROS -D__STDC_LIMIT_MACROS -fno-rtti -fno-exceptions -O2 -I/usr/pkg/include -I/usr/include -MT clang_delta-AggregateToScalar.o -MD -MP -MF .deps/clang_delta-AggregateToScalar.Tpo -c -o clang_delta-AggregateToScalar.o `test -f 'AggregateToScalar.cpp' || echo './'`AggregateToScalar.cpp
clang++ -DHAVE_CONFIG_H -I. -I..   -I"/usr/pkg/include/clang" -I/usr/pkg/include -I/usr/include -I/usr/pkg/include -std=c++14 -fno-exceptions -D__STDC_CONSTANT_MACROS -D__STDC_FORMAT_MACROS -D__STDC_LIMIT_MACROS -fno-rtti -fno-exceptions -O2 -I/usr/pkg/include -I/usr/include -MT clang_delta-BinOpSimplification.o -MD -MP -MF .deps/clang_delta-BinOpSimplification.Tpo -c -o clang_delta-BinOpSimplification.o `test -f 'BinOpSimplification.cpp' || echo './'`BinOpSimplification.cpp
clang++ -DHAVE_CONFIG_H -I. -I..   -I"/usr/pkg/include/clang" -I/usr/pkg/include -I/usr/include -I/usr/pkg/include -std=c++14 -fno-exceptions -D__STDC_CONSTANT_MACROS -D__STDC_FORMAT_MACROS -D__STDC_LIMIT_MACROS -fno-rtti -fno-exceptions -O2 -I/usr/pkg/include -I/usr/include -MT clang_delta-CallExprToValue.o -MD -MP -MF .deps/clang_delta-CallExprToValue.Tpo -c -o clang_delta-CallExprToValue.o `test -f 'CallExprToValue.cpp' || echo './'`CallExprToValue.cpp
clang++ -DHAVE_CONFIG_H -I. -I..   -I"/usr/pkg/include/clang" -I/usr/pkg/include -I/usr/include -I/usr/pkg/include -std=c++14 -fno-exceptions -D__STDC_CONSTANT_MACROS -D__STDC_FORMAT_MACROS -D__STDC_LIMIT_MACROS -fno-rtti -fno-exceptions -O2 -I/usr/pkg/include -I/usr/include -MT clang_delta-ClangDelta.o -MD -MP -MF .deps/clang_delta-ClangDelta.Tpo -c -o clang_delta-ClangDelta.o `test -f 'ClangDelta.cpp' || echo './'`ClangDelta.cpp
clang++ -DHAVE_CONFIG_H -I. -I..   -I"/usr/pkg/include/clang" -I/usr/pkg/include -I/usr/include -I/usr/pkg/include -std=c++14 -fno-exceptions -D__STDC_CONSTANT_MACROS -D__STDC_FORMAT_MACROS -D__STDC_LIMIT_MACROS -fno-rtti -fno-exceptions -O2 -I/usr/pkg/include -I/usr/include -MT clang_delta-ClassTemplateToClass.o -MD -MP -MF .deps/clang_delta-ClassTemplateToClass.Tpo -c -o clang_delta-ClassTemplateToClass.o `test -f 'ClassTemplateToClass.cpp' || echo './'`ClassTemplateToClass.cpp
clang++ -DHAVE_CONFIG_H -I. -I..   -I"/usr/pkg/include/clang" -I/usr/pkg/include -I/usr/include -I/usr/pkg/include -std=c++14 -fno-exceptions -D__STDC_CONSTANT_MACROS -D__STDC_FORMAT_MACROS -D__STDC_LIMIT_MACROS -fno-rtti -fno-exceptions -O2 -I/usr/pkg/include -I/usr/include -MT clang_delta-CombineGlobalVarDecl.o -MD -MP -MF .deps/clang_delta-CombineGlobalVarDecl.Tpo -c -o clang_delta-CombineGlobalVarDecl.o `test -f 'CombineGlobalVarDecl.cpp' || echo './'`CombineGlobalVarDecl.cpp
clang++ -DHAVE_CONFIG_H -I. -I..   -I"/usr/pkg/include/clang" -I/usr/pkg/include -I/usr/include -I/usr/pkg/include -std=c++14 -fno-exceptions -D__STDC_CONSTANT_MACROS -D__STDC_FORMAT_MACROS -D__STDC_LIMIT_MACROS -fno-rtti -fno-exceptions -O2 -I/usr/pkg/include -I/usr/include -MT clang_delta-CombineLocalVarDecl.o -MD -MP -MF .deps/clang_delta-CombineLocalVarDecl.Tpo -c -o clang_delta-CombineLocalVarDecl.o `test -f 'CombineLocalVarDecl.cpp' || echo './'`CombineLocalVarDecl.cpp
clang++ -DHAVE_CONFIG_H -I. -I..   -I"/usr/pkg/include/clang" -I/usr/pkg/include -I/usr/include -I/usr/pkg/include -std=c++14 -fno-exceptions -D__STDC_CONSTANT_MACROS -D__STDC_FORMAT_MACROS -D__STDC_LIMIT_MACROS -fno-rtti -fno-exceptions -O2 -I/usr/pkg/include -I/usr/include -MT clang_delta-CopyPropagation.o -MD -MP -MF .deps/clang_delta-CopyPropagation.Tpo -c -o clang_delta-CopyPropagation.o `test -f 'CopyPropagation.cpp' || echo './'`CopyPropagation.cpp
mv -f .deps/clang_delta-ClangDelta.Tpo .deps/clang_delta-ClangDelta.Po
clang++ -DHAVE_CONFIG_H -I. -I..   -I"/usr/pkg/include/clang" -I/usr/pkg/include -I/usr/include -I/usr/pkg/include -std=c++14 -fno-exceptions -D__STDC_CONSTANT_MACROS -D__STDC_FORMAT_MACROS -D__STDC_LIMIT_MACROS -fno-rtti -fno-exceptions -O2 -I/usr/pkg/include -I/usr/include -MT clang_delta-EmptyStructToInt.o -MD -MP -MF .deps/clang_delta-EmptyStructToInt.Tpo -c -o clang_delta-EmptyStructToInt.o `test -f 'EmptyStructToInt.cpp' || echo './'`EmptyStructToInt.cpp
mv -f .deps/clang_delta-CombineGlobalVarDecl.Tpo .deps/clang_delta-CombineGlobalVarDecl.Po
clang++ -DHAVE_CONFIG_H -I. -I..   -I"/usr/pkg/include/clang" -I/usr/pkg/include -I/usr/include -I/usr/pkg/include -std=c++14 -fno-exceptions -D__STDC_CONSTANT_MACROS -D__STDC_FORMAT_MACROS -D__STDC_LIMIT_MACROS -fno-rtti -fno-exceptions -O2 -I/usr/pkg/include -I/usr/include -MT clang_delta-ExpressionDetector.o -MD -MP -MF .deps/clang_delta-ExpressionDetector.Tpo -c -o clang_delta-ExpressionDetector.o `test -f 'ExpressionDetector.cpp' || echo './'`ExpressionDetector.cpp
mv -f .deps/clang_delta-CallExprToValue.Tpo .deps/clang_delta-CallExprToValue.Po
clang++ -DHAVE_CONFIG_H -I. -I..   -I"/usr/pkg/include/clang" -I/usr/pkg/include -I/usr/include -I/usr/pkg/include -std=c++14 -fno-exceptions -D__STDC_CONSTANT_MACROS -D__STDC_FORMAT_MACROS -D__STDC_LIMIT_MACROS -fno-rtti -fno-exceptions -O2 -I/usr/pkg/include -I/usr/include -MT clang_delta-InstantiateTemplateParam.o -MD -MP -MF .deps/clang_delta-InstantiateTemplateParam.Tpo -c -o clang_delta-InstantiateTemplateParam.o `test -f 'InstantiateTemplateParam.cpp' || echo './'`InstantiateTemplateParam.cpp
mv -f .deps/clang_delta-AggregateToScalar.Tpo .deps/clang_delta-AggregateToScalar.Po
clang++ -DHAVE_CONFIG_H -I. -I..   -I"/usr/pkg/include/clang" -I/usr/pkg/include -I/usr/include -I/usr/pkg/include -std=c++14 -fno-exceptions -D__STDC_CONSTANT_MACROS -D__STDC_FORMAT_MACROS -D__STDC_LIMIT_MACROS -fno-rtti -fno-exceptions -O2 -I/usr/pkg/include -I/usr/include -MT clang_delta-InstantiateTemplateTypeParamToInt.o -MD -MP -MF .deps/clang_delta-InstantiateTemplateTypeParamToInt.Tpo -c -o clang_delta-InstantiateTemplateTypeParamToInt.o `test -f 'InstantiateTemplateTypeParamToInt.cpp' || echo './'`InstantiateTemplateTypeParamToInt.cpp
mv -f .deps/clang_delta-CombineLocalVarDecl.Tpo .deps/clang_delta-CombineLocalVarDecl.Po
clang++ -DHAVE_CONFIG_H -I. -I..   -I"/usr/pkg/include/clang" -I/usr/pkg/include -I/usr/include -I/usr/pkg/include -std=c++14 -fno-exceptions -D__STDC_CONSTANT_MACROS -D__STDC_FORMAT_MACROS -D__STDC_LIMIT_MACROS -fno-rtti -fno-exceptions -O2 -I/usr/pkg/include -I/usr/include -MT clang_delta-LiftAssignmentExpr.o -MD -MP -MF .deps/clang_delta-LiftAssignmentExpr.Tpo -c -o clang_delta-LiftAssignmentExpr.o `test -f 'LiftAssignmentExpr.cpp' || echo './'`LiftAssignmentExpr.cpp
mv -f .deps/clang_delta-BinOpSimplification.Tpo .deps/clang_delta-BinOpSimplification.Po
clang++ -DHAVE_CONFIG_H -I. -I..   -I"/usr/pkg/include/clang" -I/usr/pkg/include -I/usr/include -I/usr/pkg/include -std=c++14 -fno-exceptions -D__STDC_CONSTANT_MACROS -D__STDC_FORMAT_MACROS -D__STDC_LIMIT_MACROS -fno-rtti -fno-exceptions -O2 -I/usr/pkg/include -I/usr/include -MT clang_delta-LocalToGlobal.o -MD -MP -MF .deps/clang_delta-LocalToGlobal.Tpo -c -o clang_delta-LocalToGlobal.o `test -f 'LocalToGlobal.cpp' || echo './'`LocalToGlobal.cpp
mv -f .deps/clang_delta-CopyPropagation.Tpo .deps/clang_delta-CopyPropagation.Po
clang++ -DHAVE_CONFIG_H -I. -I..   -I"/usr/pkg/include/clang" -I/usr/pkg/include -I/usr/include -I/usr/pkg/include -std=c++14 -fno-exceptions -D__STDC_CONSTANT_MACROS -D__STDC_FORMAT_MACROS -D__STDC_LIMIT_MACROS -fno-rtti -fno-exceptions -O2 -I/usr/pkg/include -I/usr/include -MT clang_delta-MoveFunctionBody.o -MD -MP -MF .deps/clang_delta-MoveFunctionBody.Tpo -c -o clang_delta-MoveFunctionBody.o `test -f 'MoveFunctionBody.cpp' || echo './'`MoveFunctionBody.cpp
mv -f .deps/clang_delta-EmptyStructToInt.Tpo .deps/clang_delta-EmptyStructToInt.Po
clang++ -DHAVE_CONFIG_H -I. -I..   -I"/usr/pkg/include/clang" -I/usr/pkg/include -I/usr/include -I/usr/pkg/include -std=c++14 -fno-exceptions -D__STDC_CONSTANT_MACROS -D__STDC_FORMAT_MACROS -D__STDC_LIMIT_MACROS -fno-rtti -fno-exceptions -O2 -I/usr/pkg/include -I/usr/include -MT clang_delta-MoveGlobalVar.o -MD -MP -MF .deps/clang_delta-MoveGlobalVar.Tpo -c -o clang_delta-MoveGlobalVar.o `test -f 'MoveGlobalVar.cpp' || echo './'`MoveGlobalVar.cpp
mv -f .deps/clang_delta-ClassTemplateToClass.Tpo .deps/clang_delta-ClassTemplateToClass.Po
clang++ -DHAVE_CONFIG_H -I. -I..   -I"/usr/pkg/include/clang" -I/usr/pkg/include -I/usr/include -I/usr/pkg/include -std=c++14 -fno-exceptions -D__STDC_CONSTANT_MACROS -D__STDC_FORMAT_MACROS -D__STDC_LIMIT_MACROS -fno-rtti -fno-exceptions -O2 -I/usr/pkg/include -I/usr/include -MT clang_delta-ParamToGlobal.o -MD -MP -MF .deps/clang_delta-ParamToGlobal.Tpo -c -o clang_delta-ParamToGlobal.o `test -f 'ParamToGlobal.cpp' || echo './'`ParamToGlobal.cpp
mv -f .deps/clang_delta-MoveFunctionBody.Tpo .deps/clang_delta-MoveFunctionBody.Po
clang++ -DHAVE_CONFIG_H -I. -I..   -I"/usr/pkg/include/clang" -I/usr/pkg/include -I/usr/include -I/usr/pkg/include -std=c++14 -fno-exceptions -D__STDC_CONSTANT_MACROS -D__STDC_FORMAT_MACROS -D__STDC_LIMIT_MACROS -fno-rtti -fno-exceptions -O2 -I/usr/pkg/include -I/usr/include -MT clang_delta-ParamToLocal.o -MD -MP -MF .deps/clang_delta-ParamToLocal.Tpo -c -o clang_delta-ParamToLocal.o `test -f 'ParamToLocal.cpp' || echo './'`ParamToLocal.cpp
mv -f .deps/clang_delta-MoveGlobalVar.Tpo .deps/clang_delta-MoveGlobalVar.Po
clang++ -DHAVE_CONFIG_H -I. -I..   -I"/usr/pkg/include/clang" -I/usr/pkg/include -I/usr/include -I/usr/pkg/include -std=c++14 -fno-exceptions -D__STDC_CONSTANT_MACROS -D__STDC_FORMAT_MACROS -D__STDC_LIMIT_MACROS -fno-rtti -fno-exceptions -O2 -I/usr/pkg/include -I/usr/include -MT clang_delta-ReduceArrayDim.o -MD -MP -MF .deps/clang_delta-ReduceArrayDim.Tpo -c -o clang_delta-ReduceArrayDim.o `test -f 'ReduceArrayDim.cpp' || echo './'`ReduceArrayDim.cpp
mv -f .deps/clang_delta-LiftAssignmentExpr.Tpo .deps/clang_delta-LiftAssignmentExpr.Po
clang++ -DHAVE_CONFIG_H -I. -I..   -I"/usr/pkg/include/clang" -I/usr/pkg/include -I/usr/include -I/usr/pkg/include -std=c++14 -fno-exceptions -D__STDC_CONSTANT_MACROS -D__STDC_FORMAT_MACROS -D__STDC_LIMIT_MACROS -fno-rtti -fno-exceptions -O2 -I/usr/pkg/include -I/usr/include -MT clang_delta-ReduceArraySize.o -MD -MP -MF .deps/clang_delta-ReduceArraySize.Tpo -c -o clang_delta-ReduceArraySize.o `test -f 'ReduceArraySize.cpp' || echo './'`ReduceArraySize.cpp
mv -f .deps/clang_delta-InstantiateTemplateParam.Tpo .deps/clang_delta-InstantiateTemplateParam.Po
clang++ -DHAVE_CONFIG_H -I. -I..   -I"/usr/pkg/include/clang" -I/usr/pkg/include -I/usr/include -I/usr/pkg/include -std=c++14 -fno-exceptions -D__STDC_CONSTANT_MACROS -D__STDC_FORMAT_MACROS -D__STDC_LIMIT_MACROS -fno-rtti -fno-exceptions -O2 -I/usr/pkg/include -I/usr/include -MT clang_delta-ReduceClassTemplateParameter.o -MD -MP -MF .deps/clang_delta-ReduceClassTemplateParameter.Tpo -c -o clang_delta-ReduceClassTemplateParameter.o `test -f 'ReduceClassTemplateParameter.cpp' || echo './'`ReduceClassTemplateParameter.cpp
mv -f .deps/clang_delta-ExpressionDetector.Tpo .deps/clang_delta-ExpressionDetector.Po
clang++ -DHAVE_CONFIG_H -I. -I..   -I"/usr/pkg/include/clang" -I/usr/pkg/include -I/usr/include -I/usr/pkg/include -std=c++14 -fno-exceptions -D__STDC_CONSTANT_MACROS -D__STDC_FORMAT_MACROS -D__STDC_LIMIT_MACROS -fno-rtti -fno-exceptions -O2 -I/usr/pkg/include -I/usr/include -MT clang_delta-ReducePointerLevel.o -MD -MP -MF .deps/clang_delta-ReducePointerLevel.Tpo -c -o clang_delta-ReducePointerLevel.o `test -f 'ReducePointerLevel.cpp' || echo './'`ReducePointerLevel.cpp
mv -f .deps/clang_delta-InstantiateTemplateTypeParamToInt.Tpo .deps/clang_delta-InstantiateTemplateTypeParamToInt.Po
clang++ -DHAVE_CONFIG_H -I. -I..   -I"/usr/pkg/include/clang" -I/usr/pkg/include -I/usr/include -I/usr/pkg/include -std=c++14 -fno-exceptions -D__STDC_CONSTANT_MACROS -D__STDC_FORMAT_MACROS -D__STDC_LIMIT_MACROS -fno-rtti -fno-exceptions -O2 -I/usr/pkg/include -I/usr/include -MT clang_delta-ReducePointerPairs.o -MD -MP -MF .deps/clang_delta-ReducePointerPairs.Tpo -c -o clang_delta-ReducePointerPairs.o `test -f 'ReducePointerPairs.cpp' || echo './'`ReducePointerPairs.cpp
mv -f .deps/clang_delta-ParamToGlobal.Tpo .deps/clang_delta-ParamToGlobal.Po
clang++ -DHAVE_CONFIG_H -I. -I..   -I"/usr/pkg/include/clang" -I/usr/pkg/include -I/usr/include -I/usr/pkg/include -std=c++14 -fno-exceptions -D__STDC_CONSTANT_MACROS -D__STDC_FORMAT_MACROS -D__STDC_LIMIT_MACROS -fno-rtti -fno-exceptions -O2 -I/usr/pkg/include -I/usr/include -MT clang_delta-RemoveAddrTaken.o -MD -MP -MF .deps/clang_delta-RemoveAddrTaken.Tpo -c -o clang_delta-RemoveAddrTaken.o `test -f 'RemoveAddrTaken.cpp' || echo './'`RemoveAddrTaken.cpp
mv -f .deps/clang_delta-LocalToGlobal.Tpo .deps/clang_delta-LocalToGlobal.Po
clang++ -DHAVE_CONFIG_H -I. -I..   -I"/usr/pkg/include/clang" -I/usr/pkg/include -I/usr/include -I/usr/pkg/include -std=c++14 -fno-exceptions -D__STDC_CONSTANT_MACROS -D__STDC_FORMAT_MACROS -D__STDC_LIMIT_MACROS -fno-rtti -fno-exceptions -O2 -I/usr/pkg/include -I/usr/include -MT clang_delta-RemoveArray.o -MD -MP -MF .deps/clang_delta-RemoveArray.Tpo -c -o clang_delta-RemoveArray.o `test -f 'RemoveArray.cpp' || echo './'`RemoveArray.cpp
mv -f .deps/clang_delta-ParamToLocal.Tpo .deps/clang_delta-ParamToLocal.Po
clang++ -DHAVE_CONFIG_H -I. -I..   -I"/usr/pkg/include/clang" -I/usr/pkg/include -I/usr/include -I/usr/pkg/include -std=c++14 -fno-exceptions -D__STDC_CONSTANT_MACROS -D__STDC_FORMAT_MACROS -D__STDC_LIMIT_MACROS -fno-rtti -fno-exceptions -O2 -I/usr/pkg/include -I/usr/include -MT clang_delta-RemoveBaseClass.o -MD -MP -MF .deps/clang_delta-RemoveBaseClass.Tpo -c -o clang_delta-RemoveBaseClass.o `test -f 'RemoveBaseClass.cpp' || echo './'`RemoveBaseClass.cpp
mv -f .deps/clang_delta-ReduceArrayDim.Tpo .deps/clang_delta-ReduceArrayDim.Po
clang++ -DHAVE_CONFIG_H -I. -I..   -I"/usr/pkg/include/clang" -I/usr/pkg/include -I/usr/include -I/usr/pkg/include -std=c++14 -fno-exceptions -D__STDC_CONSTANT_MACROS -D__STDC_FORMAT_MACROS -D__STDC_LIMIT_MACROS -fno-rtti -fno-exceptions -O2 -I/usr/pkg/include -I/usr/include -MT clang_delta-RemoveCtorInitializer.o -MD -MP -MF .deps/clang_delta-RemoveCtorInitializer.Tpo -c -o clang_delta-RemoveCtorInitializer.o `test -f 'RemoveCtorInitializer.cpp' || echo './'`RemoveCtorInitializer.cpp
mv -f .deps/clang_delta-ReduceArraySize.Tpo .deps/clang_delta-ReduceArraySize.Po
clang++ -DHAVE_CONFIG_H -I. -I..   -I"/usr/pkg/include/clang" -I/usr/pkg/include -I/usr/include -I/usr/pkg/include -std=c++14 -fno-exceptions -D__STDC_CONSTANT_MACROS -D__STDC_FORMAT_MACROS -D__STDC_LIMIT_MACROS -fno-rtti -fno-exceptions -O2 -I/usr/pkg/include -I/usr/include -MT clang_delta-RemoveEnumMemberValue.o -MD -MP -MF .deps/clang_delta-RemoveEnumMemberValue.Tpo -c -o clang_delta-RemoveEnumMemberValue.o `test -f 'RemoveEnumMemberValue.cpp' || echo './'`RemoveEnumMemberValue.cpp
mv -f .deps/clang_delta-RemoveAddrTaken.Tpo .deps/clang_delta-RemoveAddrTaken.Po
clang++ -DHAVE_CONFIG_H -I. -I..   -I"/usr/pkg/include/clang" -I/usr/pkg/include -I/usr/include -I/usr/pkg/include -std=c++14 -fno-exceptions -D__STDC_CONSTANT_MACROS -D__STDC_FORMAT_MACROS -D__STDC_LIMIT_MACROS -fno-rtti -fno-exceptions -O2 -I/usr/pkg/include -I/usr/include -MT clang_delta-RemoveNamespace.o -MD -MP -MF .deps/clang_delta-RemoveNamespace.Tpo -c -o clang_delta-RemoveNamespace.o `test -f 'RemoveNamespace.cpp' || echo './'`RemoveNamespace.cpp
mv -f .deps/clang_delta-RemoveCtorInitializer.Tpo .deps/clang_delta-RemoveCtorInitializer.Po
clang++ -DHAVE_CONFIG_H -I. -I..   -I"/usr/pkg/include/clang" -I/usr/pkg/include -I/usr/include -I/usr/pkg/include -std=c++14 -fno-exceptions -D__STDC_CONSTANT_MACROS -D__STDC_FORMAT_MACROS -D__STDC_LIMIT_MACROS -fno-rtti -fno-exceptions -O2 -I/usr/pkg/include -I/usr/include -MT clang_delta-RemoveNestedFunction.o -MD -MP -MF .deps/clang_delta-RemoveNestedFunction.Tpo -c -o clang_delta-RemoveNestedFunction.o `test -f 'RemoveNestedFunction.cpp' || echo './'`RemoveNestedFunction.cpp
mv -f .deps/clang_delta-ReducePointerLevel.Tpo .deps/clang_delta-ReducePointerLevel.Po
clang++ -DHAVE_CONFIG_H -I. -I..   -I"/usr/pkg/include/clang" -I/usr/pkg/include -I/usr/include -I/usr/pkg/include -std=c++14 -fno-exceptions -D__STDC_CONSTANT_MACROS -D__STDC_FORMAT_MACROS -D__STDC_LIMIT_MACROS -fno-rtti -fno-exceptions -O2 -I/usr/pkg/include -I/usr/include -MT clang_delta-RemovePointer.o -MD -MP -MF .deps/clang_delta-RemovePointer.Tpo -c -o clang_delta-RemovePointer.o `test -f 'RemovePointer.cpp' || echo './'`RemovePointer.cpp
mv -f .deps/clang_delta-ReducePointerPairs.Tpo .deps/clang_delta-ReducePointerPairs.Po
clang++ -DHAVE_CONFIG_H -I. -I..   -I"/usr/pkg/include/clang" -I/usr/pkg/include -I/usr/include -I/usr/pkg/include -std=c++14 -fno-exceptions -D__STDC_CONSTANT_MACROS -D__STDC_FORMAT_MACROS -D__STDC_LIMIT_MACROS -fno-rtti -fno-exceptions -O2 -I/usr/pkg/include -I/usr/include -MT clang_delta-RemoveTrivialBaseTemplate.o -MD -MP -MF .deps/clang_delta-RemoveTrivialBaseTemplate.Tpo -c -o clang_delta-RemoveTrivialBaseTemplate.o `test -f 'RemoveTrivialBaseTemplate.cpp' || echo './'`RemoveTrivialBaseTemplate.cpp
mv -f .deps/clang_delta-RemoveArray.Tpo .deps/clang_delta-RemoveArray.Po
clang++ -DHAVE_CONFIG_H -I. -I..   -I"/usr/pkg/include/clang" -I/usr/pkg/include -I/usr/include -I/usr/pkg/include -std=c++14 -fno-exceptions -D__STDC_CONSTANT_MACROS -D__STDC_FORMAT_MACROS -D__STDC_LIMIT_MACROS -fno-rtti -fno-exceptions -O2 -I/usr/pkg/include -I/usr/include -MT clang_delta-RemoveUnresolvedBase.o -MD -MP -MF .deps/clang_delta-RemoveUnresolvedBase.Tpo -c -o clang_delta-RemoveUnresolvedBase.o `test -f 'RemoveUnresolvedBase.cpp' || echo './'`RemoveUnresolvedBase.cpp
mv -f .deps/clang_delta-RemoveEnumMemberValue.Tpo .deps/clang_delta-RemoveEnumMemberValue.Po
clang++ -DHAVE_CONFIG_H -I. -I..   -I"/usr/pkg/include/clang" -I/usr/pkg/include -I/usr/include -I/usr/pkg/include -std=c++14 -fno-exceptions -D__STDC_CONSTANT_MACROS -D__STDC_FORMAT_MACROS -D__STDC_LIMIT_MACROS -fno-rtti -fno-exceptions -O2 -I/usr/pkg/include -I/usr/include -MT clang_delta-RemoveUnusedEnumMember.o -MD -MP -MF .deps/clang_delta-RemoveUnusedEnumMember.Tpo -c -o clang_delta-RemoveUnusedEnumMember.o `test -f 'RemoveUnusedEnumMember.cpp' || echo './'`RemoveUnusedEnumMember.cpp
mv -f .deps/clang_delta-RemoveBaseClass.Tpo .deps/clang_delta-RemoveBaseClass.Po
clang++ -DHAVE_CONFIG_H -I. -I..   -I"/usr/pkg/include/clang" -I/usr/pkg/include -I/usr/include -I/usr/pkg/include -std=c++14 -fno-exceptions -D__STDC_CONSTANT_MACROS -D__STDC_FORMAT_MACROS -D__STDC_LIMIT_MACROS -fno-rtti -fno-exceptions -O2 -I/usr/pkg/include -I/usr/include -MT clang_delta-RemoveUnusedFunction.o -MD -MP -MF .deps/clang_delta-RemoveUnusedFunction.Tpo -c -o clang_delta-RemoveUnusedFunction.o `test -f 'RemoveUnusedFunction.cpp' || echo './'`RemoveUnusedFunction.cpp
mv -f .deps/clang_delta-RemoveTrivialBaseTemplate.Tpo .deps/clang_delta-RemoveTrivialBaseTemplate.Po
clang++ -DHAVE_CONFIG_H -I. -I..   -I"/usr/pkg/include/clang" -I/usr/pkg/include -I/usr/include -I/usr/pkg/include -std=c++14 -fno-exceptions -D__STDC_CONSTANT_MACROS -D__STDC_FORMAT_MACROS -D__STDC_LIMIT_MACROS -fno-rtti -fno-exceptions -O2 -I/usr/pkg/include -I/usr/include -MT clang_delta-RemoveUnusedOuterClass.o -MD -MP -MF .deps/clang_delta-RemoveUnusedOuterClass.Tpo -c -o clang_delta-RemoveUnusedOuterClass.o `test -f 'RemoveUnusedOuterClass.cpp' || echo './'`RemoveUnusedOuterClass.cpp
mv -f .deps/clang_delta-ReduceClassTemplateParameter.Tpo .deps/clang_delta-ReduceClassTemplateParameter.Po
clang++ -DHAVE_CONFIG_H -I. -I..   -I"/usr/pkg/include/clang" -I/usr/pkg/include -I/usr/include -I/usr/pkg/include -std=c++14 -fno-exceptions -D__STDC_CONSTANT_MACROS -D__STDC_FORMAT_MACROS -D__STDC_LIMIT_MACROS -fno-rtti -fno-exceptions -O2 -I/usr/pkg/include -I/usr/include -MT clang_delta-RemoveUnusedStructField.o -MD -MP -MF .deps/clang_delta-RemoveUnusedStructField.Tpo -c -o clang_delta-RemoveUnusedStructField.o `test -f 'RemoveUnusedStructField.cpp' || echo './'`RemoveUnusedStructField.cpp
mv -f .deps/clang_delta-RemoveUnusedEnumMember.Tpo .deps/clang_delta-RemoveUnusedEnumMember.Po
clang++ -DHAVE_CONFIG_H -I. -I..   -I"/usr/pkg/include/clang" -I/usr/pkg/include -I/usr/include -I/usr/pkg/include -std=c++14 -fno-exceptions -D__STDC_CONSTANT_MACROS -D__STDC_FORMAT_MACROS -D__STDC_LIMIT_MACROS -fno-rtti -fno-exceptions -O2 -I/usr/pkg/include -I/usr/include -MT clang_delta-RemoveUnusedVar.o -MD -MP -MF .deps/clang_delta-RemoveUnusedVar.Tpo -c -o clang_delta-RemoveUnusedVar.o `test -f 'RemoveUnusedVar.cpp' || echo './'`RemoveUnusedVar.cpp
mv -f .deps/clang_delta-RemoveUnresolvedBase.Tpo .deps/clang_delta-RemoveUnresolvedBase.Po
clang++ -DHAVE_CONFIG_H -I. -I..   -I"/usr/pkg/include/clang" -I/usr/pkg/include -I/usr/include -I/usr/pkg/include -std=c++14 -fno-exceptions -D__STDC_CONSTANT_MACROS -D__STDC_FORMAT_MACROS -D__STDC_LIMIT_MACROS -fno-rtti -fno-exceptions -O2 -I/usr/pkg/include -I/usr/include -MT clang_delta-RenameCXXMethod.o -MD -MP -MF .deps/clang_delta-RenameCXXMethod.Tpo -c -o clang_delta-RenameCXXMethod.o `test -f 'RenameCXXMethod.cpp' || echo './'`RenameCXXMethod.cpp
mv -f .deps/clang_delta-RemovePointer.Tpo .deps/clang_delta-RemovePointer.Po
clang++ -DHAVE_CONFIG_H -I. -I..   -I"/usr/pkg/include/clang" -I/usr/pkg/include -I/usr/include -I/usr/pkg/include -std=c++14 -fno-exceptions -D__STDC_CONSTANT_MACROS -D__STDC_FORMAT_MACROS -D__STDC_LIMIT_MACROS -fno-rtti -fno-exceptions -O2 -I/usr/pkg/include -I/usr/include -MT clang_delta-RenameClass.o -MD -MP -MF .deps/clang_delta-RenameClass.Tpo -c -o clang_delta-RenameClass.o `test -f 'RenameClass.cpp' || echo './'`RenameClass.cpp
mv -f .deps/clang_delta-RemoveNestedFunction.Tpo .deps/clang_delta-RemoveNestedFunction.Po
clang++ -DHAVE_CONFIG_H -I. -I..   -I"/usr/pkg/include/clang" -I/usr/pkg/include -I/usr/include -I/usr/pkg/include -std=c++14 -fno-exceptions -D__STDC_CONSTANT_MACROS -D__STDC_FORMAT_MACROS -D__STDC_LIMIT_MACROS -fno-rtti -fno-exceptions -O2 -I/usr/pkg/include -I/usr/include -MT clang_delta-RenameFun.o -MD -MP -MF .deps/clang_delta-RenameFun.Tpo -c -o clang_delta-RenameFun.o `test -f 'RenameFun.cpp' || echo './'`RenameFun.cpp
mv -f .deps/clang_delta-RemoveNamespace.Tpo .deps/clang_delta-RemoveNamespace.Po
clang++ -DHAVE_CONFIG_H -I. -I..   -I"/usr/pkg/include/clang" -I/usr/pkg/include -I/usr/include -I/usr/pkg/include -std=c++14 -fno-exceptions -D__STDC_CONSTANT_MACROS -D__STDC_FORMAT_MACROS -D__STDC_LIMIT_MACROS -fno-rtti -fno-exceptions -O2 -I/usr/pkg/include -I/usr/include -MT clang_delta-RenameParam.o -MD -MP -MF .deps/clang_delta-RenameParam.Tpo -c -o clang_delta-RenameParam.o `test -f 'RenameParam.cpp' || echo './'`RenameParam.cpp
mv -f .deps/clang_delta-RemoveUnusedOuterClass.Tpo .deps/clang_delta-RemoveUnusedOuterClass.Po
clang++ -DHAVE_CONFIG_H -I. -I..   -I"/usr/pkg/include/clang" -I/usr/pkg/include -I/usr/include -I/usr/pkg/include -std=c++14 -fno-exceptions -D__STDC_CONSTANT_MACROS -D__STDC_FORMAT_MACROS -D__STDC_LIMIT_MACROS -fno-rtti -fno-exceptions -O2 -I/usr/pkg/include -I/usr/include -MT clang_delta-RenameVar.o -MD -MP -MF .deps/clang_delta-RenameVar.Tpo -c -o clang_delta-RenameVar.o `test -f 'RenameVar.cpp' || echo './'`RenameVar.cpp
mv -f .deps/clang_delta-RemoveUnusedVar.Tpo .deps/clang_delta-RemoveUnusedVar.Po
clang++ -DHAVE_CONFIG_H -I. -I..   -I"/usr/pkg/include/clang" -I/usr/pkg/include -I/usr/include -I/usr/pkg/include -std=c++14 -fno-exceptions -D__STDC_CONSTANT_MACROS -D__STDC_FORMAT_MACROS -D__STDC_LIMIT_MACROS -fno-rtti -fno-exceptions -O2 -I/usr/pkg/include -I/usr/include -MT clang_delta-ReplaceArrayAccessWithIndex.o -MD -MP -MF .deps/clang_delta-ReplaceArrayAccessWithIndex.Tpo -c -o clang_delta-ReplaceArrayAccessWithIndex.o `test -f 'ReplaceArrayAccessWithIndex.cpp' || echo './'`ReplaceArrayAccessWithIndex.cpp
mv -f .deps/clang_delta-RemoveUnusedStructField.Tpo .deps/clang_delta-RemoveUnusedStructField.Po
clang++ -DHAVE_CONFIG_H -I. -I..   -I"/usr/pkg/include/clang" -I/usr/pkg/include -I/usr/include -I/usr/pkg/include -std=c++14 -fno-exceptions -D__STDC_CONSTANT_MACROS -D__STDC_FORMAT_MACROS -D__STDC_LIMIT_MACROS -fno-rtti -fno-exceptions -O2 -I/usr/pkg/include -I/usr/include -MT clang_delta-ReplaceArrayIndexVar.o -MD -MP -MF .deps/clang_delta-ReplaceArrayIndexVar.Tpo -c -o clang_delta-ReplaceArrayIndexVar.o `test -f 'ReplaceArrayIndexVar.cpp' || echo './'`ReplaceArrayIndexVar.cpp
mv -f .deps/clang_delta-RenameClass.Tpo .deps/clang_delta-RenameClass.Po
clang++ -DHAVE_CONFIG_H -I. -I..   -I"/usr/pkg/include/clang" -I/usr/pkg/include -I/usr/include -I/usr/pkg/include -std=c++14 -fno-exceptions -D__STDC_CONSTANT_MACROS -D__STDC_FORMAT_MACROS -D__STDC_LIMIT_MACROS -fno-rtti -fno-exceptions -O2 -I/usr/pkg/include -I/usr/include -MT clang_delta-ReplaceCallExpr.o -MD -MP -MF .deps/clang_delta-ReplaceCallExpr.Tpo -c -o clang_delta-ReplaceCallExpr.o `test -f 'ReplaceCallExpr.cpp' || echo './'`ReplaceCallExpr.cpp
mv -f .deps/clang_delta-RenameCXXMethod.Tpo .deps/clang_delta-RenameCXXMethod.Po
clang++ -DHAVE_CONFIG_H -I. -I..   -I"/usr/pkg/include/clang" -I/usr/pkg/include -I/usr/include -I/usr/pkg/include -std=c++14 -fno-exceptions -D__STDC_CONSTANT_MACROS -D__STDC_FORMAT_MACROS -D__STDC_LIMIT_MACROS -fno-rtti -fno-exceptions -O2 -I/usr/pkg/include -I/usr/include -MT clang_delta-ReplaceClassWithBaseTemplateSpec.o -MD -MP -MF .deps/clang_delta-ReplaceClassWithBaseTemplateSpec.Tpo -c -o clang_delta-ReplaceClassWithBaseTemplateSpec.o `test -f 'ReplaceClassWithBaseTemplateSpec.cpp' || echo './'`ReplaceClassWithBaseTemplateSpec.cpp
mv -f .deps/clang_delta-RenameFun.Tpo .deps/clang_delta-RenameFun.Po
clang++ -DHAVE_CONFIG_H -I. -I..   -I"/usr/pkg/include/clang" -I/usr/pkg/include -I/usr/include -I/usr/pkg/include -std=c++14 -fno-exceptions -D__STDC_CONSTANT_MACROS -D__STDC_FORMAT_MACROS -D__STDC_LIMIT_MACROS -fno-rtti -fno-exceptions -O2 -I/usr/pkg/include -I/usr/include -MT clang_delta-ReplaceDependentName.o -MD -MP -MF .deps/clang_delta-ReplaceDependentName.Tpo -c -o clang_delta-ReplaceDependentName.o `test -f 'ReplaceDependentName.cpp' || echo './'`ReplaceDependentName.cpp
mv -f .deps/clang_delta-RenameParam.Tpo .deps/clang_delta-RenameParam.Po
clang++ -DHAVE_CONFIG_H -I. -I..   -I"/usr/pkg/include/clang" -I/usr/pkg/include -I/usr/include -I/usr/pkg/include -std=c++14 -fno-exceptions -D__STDC_CONSTANT_MACROS -D__STDC_FORMAT_MACROS -D__STDC_LIMIT_MACROS -fno-rtti -fno-exceptions -O2 -I/usr/pkg/include -I/usr/include -MT clang_delta-ReplaceDependentTypedef.o -MD -MP -MF .deps/clang_delta-ReplaceDependentTypedef.Tpo -c -o clang_delta-ReplaceDependentTypedef.o `test -f 'ReplaceDependentTypedef.cpp' || echo './'`ReplaceDependentTypedef.cpp
mv -f .deps/clang_delta-RemoveUnusedFunction.Tpo .deps/clang_delta-RemoveUnusedFunction.Po
clang++ -DHAVE_CONFIG_H -I. -I..   -I"/usr/pkg/include/clang" -I/usr/pkg/include -I/usr/include -I/usr/pkg/include -std=c++14 -fno-exceptions -D__STDC_CONSTANT_MACROS -D__STDC_FORMAT_MACROS -D__STDC_LIMIT_MACROS -fno-rtti -fno-exceptions -O2 -I/usr/pkg/include -I/usr/include -MT clang_delta-ReplaceDerivedClass.o -MD -MP -MF .deps/clang_delta-ReplaceDerivedClass.Tpo -c -o clang_delta-ReplaceDerivedClass.o `test -f 'ReplaceDerivedClass.cpp' || echo './'`ReplaceDerivedClass.cpp
mv -f .deps/clang_delta-ReplaceArrayAccessWithIndex.Tpo .deps/clang_delta-ReplaceArrayAccessWithIndex.Po
clang++ -DHAVE_CONFIG_H -I. -I..   -I"/usr/pkg/include/clang" -I/usr/pkg/include -I/usr/include -I/usr/pkg/include -std=c++14 -fno-exceptions -D__STDC_CONSTANT_MACROS -D__STDC_FORMAT_MACROS -D__STDC_LIMIT_MACROS -fno-rtti -fno-exceptions -O2 -I/usr/pkg/include -I/usr/include -MT clang_delta-ReplaceFunctionDefWithDecl.o -MD -MP -MF .deps/clang_delta-ReplaceFunctionDefWithDecl.Tpo -c -o clang_delta-ReplaceFunctionDefWithDecl.o `test -f 'ReplaceFunctionDefWithDecl.cpp' || echo './'`ReplaceFunctionDefWithDecl.cpp
mv -f .deps/clang_delta-RenameVar.Tpo .deps/clang_delta-RenameVar.Po
clang++ -DHAVE_CONFIG_H -I. -I..   -I"/usr/pkg/include/clang" -I/usr/pkg/include -I/usr/include -I/usr/pkg/include -std=c++14 -fno-exceptions -D__STDC_CONSTANT_MACROS -D__STDC_FORMAT_MACROS -D__STDC_LIMIT_MACROS -fno-rtti -fno-exceptions -O2 -I/usr/pkg/include -I/usr/include -MT clang_delta-ReplaceOneLevelTypedefType.o -MD -MP -MF .deps/clang_delta-ReplaceOneLevelTypedefType.Tpo -c -o clang_delta-ReplaceOneLevelTypedefType.o `test -f 'ReplaceOneLevelTypedefType.cpp' || echo './'`ReplaceOneLevelTypedefType.cpp
mv -f .deps/clang_delta-ReplaceDependentName.Tpo .deps/clang_delta-ReplaceDependentName.Po
clang++ -DHAVE_CONFIG_H -I. -I..   -I"/usr/pkg/include/clang" -I/usr/pkg/include -I/usr/include -I/usr/pkg/include -std=c++14 -fno-exceptions -D__STDC_CONSTANT_MACROS -D__STDC_FORMAT_MACROS -D__STDC_LIMIT_MACROS -fno-rtti -fno-exceptions -O2 -I/usr/pkg/include -I/usr/include -MT clang_delta-ReplaceSimpleTypedef.o -MD -MP -MF .deps/clang_delta-ReplaceSimpleTypedef.Tpo -c -o clang_delta-ReplaceSimpleTypedef.o `test -f 'ReplaceSimpleTypedef.cpp' || echo './'`ReplaceSimpleTypedef.cpp
mv -f .deps/clang_delta-ReplaceDependentTypedef.Tpo .deps/clang_delta-ReplaceDependentTypedef.Po
clang++ -DHAVE_CONFIG_H -I. -I..   -I"/usr/pkg/include/clang" -I/usr/pkg/include -I/usr/include -I/usr/pkg/include -std=c++14 -fno-exceptions -D__STDC_CONSTANT_MACROS -D__STDC_FORMAT_MACROS -D__STDC_LIMIT_MACROS -fno-rtti -fno-exceptions -O2 -I/usr/pkg/include -I/usr/include -MT clang_delta-ReplaceUndefinedFunction.o -MD -MP -MF .deps/clang_delta-ReplaceUndefinedFunction.Tpo -c -o clang_delta-ReplaceUndefinedFunction.o `test -f 'ReplaceUndefinedFunction.cpp' || echo './'`ReplaceUndefinedFunction.cpp
mv -f .deps/clang_delta-ReplaceArrayIndexVar.Tpo .deps/clang_delta-ReplaceArrayIndexVar.Po
clang++ -DHAVE_CONFIG_H -I. -I..   -I"/usr/pkg/include/clang" -I/usr/pkg/include -I/usr/include -I/usr/pkg/include -std=c++14 -fno-exceptions -D__STDC_CONSTANT_MACROS -D__STDC_FORMAT_MACROS -D__STDC_LIMIT_MACROS -fno-rtti -fno-exceptions -O2 -I/usr/pkg/include -I/usr/include -MT clang_delta-ReturnVoid.o -MD -MP -MF .deps/clang_delta-ReturnVoid.Tpo -c -o clang_delta-ReturnVoid.o `test -f 'ReturnVoid.cpp' || echo './'`ReturnVoid.cpp
mv -f .deps/clang_delta-ReplaceCallExpr.Tpo .deps/clang_delta-ReplaceCallExpr.Po
clang++ -DHAVE_CONFIG_H -I. -I..   -I"/usr/pkg/include/clang" -I/usr/pkg/include -I/usr/include -I/usr/pkg/include -std=c++14 -fno-exceptions -D__STDC_CONSTANT_MACROS -D__STDC_FORMAT_MACROS -D__STDC_LIMIT_MACROS -fno-rtti -fno-exceptions -O2 -I/usr/pkg/include -I/usr/include -MT clang_delta-RewriteUtils.o -MD -MP -MF .deps/clang_delta-RewriteUtils.Tpo -c -o clang_delta-RewriteUtils.o `test -f 'RewriteUtils.cpp' || echo './'`RewriteUtils.cpp
mv -f .deps/clang_delta-ReplaceFunctionDefWithDecl.Tpo .deps/clang_delta-ReplaceFunctionDefWithDecl.Po
clang++ -DHAVE_CONFIG_H -I. -I..   -I"/usr/pkg/include/clang" -I/usr/pkg/include -I/usr/include -I/usr/pkg/include -std=c++14 -fno-exceptions -D__STDC_CONSTANT_MACROS -D__STDC_FORMAT_MACROS -D__STDC_LIMIT_MACROS -fno-rtti -fno-exceptions -O2 -I/usr/pkg/include -I/usr/include -MT clang_delta-SimpleInliner.o -MD -MP -MF .deps/clang_delta-SimpleInliner.Tpo -c -o clang_delta-SimpleInliner.o `test -f 'SimpleInliner.cpp' || echo './'`SimpleInliner.cpp
mv -f .deps/clang_delta-ReplaceClassWithBaseTemplateSpec.Tpo .deps/clang_delta-ReplaceClassWithBaseTemplateSpec.Po
clang++ -DHAVE_CONFIG_H -I. -I..   -I"/usr/pkg/include/clang" -I/usr/pkg/include -I/usr/include -I/usr/pkg/include -std=c++14 -fno-exceptions -D__STDC_CONSTANT_MACROS -D__STDC_FORMAT_MACROS -D__STDC_LIMIT_MACROS -fno-rtti -fno-exceptions -O2 -I/usr/pkg/include -I/usr/include -MT clang_delta-SimplifyCallExpr.o -MD -MP -MF .deps/clang_delta-SimplifyCallExpr.Tpo -c -o clang_delta-SimplifyCallExpr.o `test -f 'SimplifyCallExpr.cpp' || echo './'`SimplifyCallExpr.cpp
mv -f .deps/clang_delta-RewriteUtils.Tpo .deps/clang_delta-RewriteUtils.Po
clang++ -DHAVE_CONFIG_H -I. -I..   -I"/usr/pkg/include/clang" -I/usr/pkg/include -I/usr/include -I/usr/pkg/include -std=c++14 -fno-exceptions -D__STDC_CONSTANT_MACROS -D__STDC_FORMAT_MACROS -D__STDC_LIMIT_MACROS -fno-rtti -fno-exceptions -O2 -I/usr/pkg/include -I/usr/include -MT clang_delta-SimplifyCommaExpr.o -MD -MP -MF .deps/clang_delta-SimplifyCommaExpr.Tpo -c -o clang_delta-SimplifyCommaExpr.o `test -f 'SimplifyCommaExpr.cpp' || echo './'`SimplifyCommaExpr.cpp
mv -f .deps/clang_delta-ReplaceDerivedClass.Tpo .deps/clang_delta-ReplaceDerivedClass.Po
clang++ -DHAVE_CONFIG_H -I. -I..   -I"/usr/pkg/include/clang" -I/usr/pkg/include -I/usr/include -I/usr/pkg/include -std=c++14 -fno-exceptions -D__STDC_CONSTANT_MACROS -D__STDC_FORMAT_MACROS -D__STDC_LIMIT_MACROS -fno-rtti -fno-exceptions -O2 -I/usr/pkg/include -I/usr/include -MT clang_delta-SimplifyDependentTypedef.o -MD -MP -MF .deps/clang_delta-SimplifyDependentTypedef.Tpo -c -o clang_delta-SimplifyDependentTypedef.o `test -f 'SimplifyDependentTypedef.cpp' || echo './'`SimplifyDependentTypedef.cpp
mv -f .deps/clang_delta-ReplaceOneLevelTypedefType.Tpo .deps/clang_delta-ReplaceOneLevelTypedefType.Po
clang++ -DHAVE_CONFIG_H -I. -I..   -I"/usr/pkg/include/clang" -I/usr/pkg/include -I/usr/include -I/usr/pkg/include -std=c++14 -fno-exceptions -D__STDC_CONSTANT_MACROS -D__STDC_FORMAT_MACROS -D__STDC_LIMIT_MACROS -fno-rtti -fno-exceptions -O2 -I/usr/pkg/include -I/usr/include -MT clang_delta-SimplifyIf.o -MD -MP -MF .deps/clang_delta-SimplifyIf.Tpo -c -o clang_delta-SimplifyIf.o `test -f 'SimplifyIf.cpp' || echo './'`SimplifyIf.cpp
mv -f .deps/clang_delta-ReplaceUndefinedFunction.Tpo .deps/clang_delta-ReplaceUndefinedFunction.Po
clang++ -DHAVE_CONFIG_H -I. -I..   -I"/usr/pkg/include/clang" -I/usr/pkg/include -I/usr/include -I/usr/pkg/include -std=c++14 -fno-exceptions -D__STDC_CONSTANT_MACROS -D__STDC_FORMAT_MACROS -D__STDC_LIMIT_MACROS -fno-rtti -fno-exceptions -O2 -I/usr/pkg/include -I/usr/include -MT clang_delta-SimplifyNestedClass.o -MD -MP -MF .deps/clang_delta-SimplifyNestedClass.Tpo -c -o clang_delta-SimplifyNestedClass.o `test -f 'SimplifyNestedClass.cpp' || echo './'`SimplifyNestedClass.cpp
mv -f .deps/clang_delta-SimplifyCallExpr.Tpo .deps/clang_delta-SimplifyCallExpr.Po
clang++ -DHAVE_CONFIG_H -I. -I..   -I"/usr/pkg/include/clang" -I/usr/pkg/include -I/usr/include -I/usr/pkg/include -std=c++14 -fno-exceptions -D__STDC_CONSTANT_MACROS -D__STDC_FORMAT_MACROS -D__STDC_LIMIT_MACROS -fno-rtti -fno-exceptions -O2 -I/usr/pkg/include -I/usr/include -MT clang_delta-SimplifyRecursiveTemplateInstantiation.o -MD -MP -MF .deps/clang_delta-SimplifyRecursiveTemplateInstantiation.Tpo -c -o clang_delta-SimplifyRecursiveTemplateInstantiation.o `test -f 'SimplifyRecursiveTemplateInstantiation.cpp' || echo './'`SimplifyRecursiveTemplateInstantiation.cpp
mv -f .deps/clang_delta-ReplaceSimpleTypedef.Tpo .deps/clang_delta-ReplaceSimpleTypedef.Po
clang++ -DHAVE_CONFIG_H -I. -I..   -I"/usr/pkg/include/clang" -I/usr/pkg/include -I/usr/include -I/usr/pkg/include -std=c++14 -fno-exceptions -D__STDC_CONSTANT_MACROS -D__STDC_FORMAT_MACROS -D__STDC_LIMIT_MACROS -fno-rtti -fno-exceptions -O2 -I/usr/pkg/include -I/usr/include -MT clang_delta-SimplifyStruct.o -MD -MP -MF .deps/clang_delta-SimplifyStruct.Tpo -c -o clang_delta-SimplifyStruct.o `test -f 'SimplifyStruct.cpp' || echo './'`SimplifyStruct.cpp
mv -f .deps/clang_delta-ReturnVoid.Tpo .deps/clang_delta-ReturnVoid.Po
clang++ -DHAVE_CONFIG_H -I. -I..   -I"/usr/pkg/include/clang" -I/usr/pkg/include -I/usr/include -I/usr/pkg/include -std=c++14 -fno-exceptions -D__STDC_CONSTANT_MACROS -D__STDC_FORMAT_MACROS -D__STDC_LIMIT_MACROS -fno-rtti -fno-exceptions -O2 -I/usr/pkg/include -I/usr/include -MT clang_delta-SimplifyStructUnionDecl.o -MD -MP -MF .deps/clang_delta-SimplifyStructUnionDecl.Tpo -c -o clang_delta-SimplifyStructUnionDecl.o `test -f 'SimplifyStructUnionDecl.cpp' || echo './'`SimplifyStructUnionDecl.cpp
mv -f .deps/clang_delta-SimplifyIf.Tpo .deps/clang_delta-SimplifyIf.Po
clang++ -DHAVE_CONFIG_H -I. -I..   -I"/usr/pkg/include/clang" -I/usr/pkg/include -I/usr/include -I/usr/pkg/include -std=c++14 -fno-exceptions -D__STDC_CONSTANT_MACROS -D__STDC_FORMAT_MACROS -D__STDC_LIMIT_MACROS -fno-rtti -fno-exceptions -O2 -I/usr/pkg/include -I/usr/include -MT clang_delta-TemplateArgToInt.o -MD -MP -MF .deps/clang_delta-TemplateArgToInt.Tpo -c -o clang_delta-TemplateArgToInt.o `test -f 'TemplateArgToInt.cpp' || echo './'`TemplateArgToInt.cpp
mv -f .deps/clang_delta-SimplifyCommaExpr.Tpo .deps/clang_delta-SimplifyCommaExpr.Po
clang++ -DHAVE_CONFIG_H -I. -I..   -I"/usr/pkg/include/clang" -I/usr/pkg/include -I/usr/include -I/usr/pkg/include -std=c++14 -fno-exceptions -D__STDC_CONSTANT_MACROS -D__STDC_FORMAT_MACROS -D__STDC_LIMIT_MACROS -fno-rtti -fno-exceptions -O2 -I/usr/pkg/include -I/usr/include -MT clang_delta-TemplateNonTypeArgToInt.o -MD -MP -MF .deps/clang_delta-TemplateNonTypeArgToInt.Tpo -c -o clang_delta-TemplateNonTypeArgToInt.o `test -f 'TemplateNonTypeArgToInt.cpp' || echo './'`TemplateNonTypeArgToInt.cpp
mv -f .deps/clang_delta-SimplifyDependentTypedef.Tpo .deps/clang_delta-SimplifyDependentTypedef.Po
clang++ -DHAVE_CONFIG_H -I. -I..   -I"/usr/pkg/include/clang" -I/usr/pkg/include -I/usr/include -I/usr/pkg/include -std=c++14 -fno-exceptions -D__STDC_CONSTANT_MACROS -D__STDC_FORMAT_MACROS -D__STDC_LIMIT_MACROS -fno-rtti -fno-exceptions -O2 -I/usr/pkg/include -I/usr/include -MT clang_delta-Transformation.o -MD -MP -MF .deps/clang_delta-Transformation.Tpo -c -o clang_delta-Transformation.o `test -f 'Transformation.cpp' || echo './'`Transformation.cpp
mv -f .deps/clang_delta-SimplifyStructUnionDecl.Tpo .deps/clang_delta-SimplifyStructUnionDecl.Po
clang++ -DHAVE_CONFIG_H -I. -I..   -I"/usr/pkg/include/clang" -I/usr/pkg/include -I/usr/include -I/usr/pkg/include -std=c++14 -fno-exceptions -D__STDC_CONSTANT_MACROS -D__STDC_FORMAT_MACROS -D__STDC_LIMIT_MACROS -fno-rtti -fno-exceptions -O2 -I/usr/pkg/include -I/usr/include -MT clang_delta-TransformationManager.o -MD -MP -MF .deps/clang_delta-TransformationManager.Tpo -c -o clang_delta-TransformationManager.o `test -f 'TransformationManager.cpp' || echo './'`TransformationManager.cpp
In file included from TransformationManager.cpp:22:
In file included from /data/scratch/devel/creduce/work/.buildlink/include/clang/Frontend/CompilerInstance.h:15:
In file included from /data/scratch/devel/creduce/work/.buildlink/include/clang/Frontend/CompilerInvocation.h:22:
/data/scratch/devel/creduce/work/.buildlink/include/clang/StaticAnalyzer/Core/AnalyzerOptions.h:439:9: warning: 'PACKAGE' macro redefined [-Wmacro-redefined]
#define PACKAGE(FULLNAME) llvm::StringLiteral(FULLNAME),
        ^
../config.h:41:9: note: previous definition is here
#define PACKAGE "creduce"
        ^
TransformationManager.cpp:104:38: error: no member named 'C' in 'clang::InputKind'
  if (IK.getLanguage() == InputKind::C) {
                          ~~~~~~~~~~~^
TransformationManager.cpp:105:73: error: no member named 'C' in 'clang::InputKind'
    Invocation.setLangDefaults(ClangInstance->getLangOpts(), InputKind::C, T, PPOpts);
                                                             ~~~~~~~~~~~^
TransformationManager.cpp:107:43: error: no member named 'CXX' in 'clang::InputKind'
  else if (IK.getLanguage() == InputKind::CXX) {
                               ~~~~~~~~~~~^
TransformationManager.cpp:111:73: error: no member named 'CXX' in 'clang::InputKind'
    Invocation.setLangDefaults(ClangInstance->getLangOpts(), InputKind::CXX, T, PPOpts);
                                                             ~~~~~~~~~~~^
TransformationManager.cpp:113:42: error: no member named 'OpenCL' in 'clang::InputKind'
  else if(IK.getLanguage() == InputKind::OpenCL) {
                              ~~~~~~~~~~~^
TransformationManager.cpp:125:69: warning: comparison between NULL and non-pointer ('llvm::ErrorOr<const DirectoryEntry *>' and NULL) [-Wnull-arithmetic]
       ClangInstance->getFileManager().getDirectory(CLCPath, false) != NULL) {
       ~~~~~~~~~~~~~~~~~~~~~~~~~~~~~~~~~~~~~~~~~~~~~~~~~~~~~~~~~~~~ ^  ~~~~
TransformationManager.cpp:125:69: error: invalid operands to binary expression ('llvm::ErrorOr<const DirectoryEntry *>' and 'long')
       ClangInstance->getFileManager().getDirectory(CLCPath, false) != NULL) {
       ~~~~~~~~~~~~~~~~~~~~~~~~~~~~~~~~~~~~~~~~~~~~~~~~~~~~~~~~~~~~ ^  ~~~~
/data/scratch/devel/creduce/work/.buildlink/include/llvm/Support/Alignment.h:256:13: note: candidate function not viable: no known conversion from 'llvm::ErrorOr<const DirectoryEntry *>' to 'llvm::Align' for 1st argument
inline bool operator!=(Align Lhs, uint64_t Rhs) {
            ^
/data/scratch/devel/creduce/work/.buildlink/include/llvm/Support/Alignment.h:281:13: note: candidate function not viable: no known conversion from 'llvm::ErrorOr<const DirectoryEntry *>' to 'llvm::MaybeAlign' for 1st argument
inline bool operator!=(MaybeAlign Lhs, uint64_t Rhs) {
            ^
/data/scratch/devel/creduce/work/.buildlink/include/llvm/ADT/StringRef.h:892:15: note: candidate function not viable: no known conversion from 'llvm::ErrorOr<const DirectoryEntry *>' to 'llvm::StringRef' for 1st argument
  inline bool operator!=(StringRef LHS, StringRef RHS) { return !(LHS == RHS); }
              ^
/data/scratch/devel/creduce/work/.buildlink/include/clang/Basic/SourceLocation.h:187:13: note: candidate function not viable: no known conversion from 'llvm::ErrorOr<const DirectoryEntry *>' to 'const clang::SourceLocation' for 1st argument
inline bool operator!=(const SourceLocation &LHS, const SourceLocation &RHS) {
            ^
/data/scratch/devel/creduce/work/.buildlink/include/llvm/Support/Alignment.h:309:13: note: candidate function not viable: no known conversion from 'llvm::ErrorOr<const DirectoryEntry *>' to 'llvm::Align' for 1st argument
inline bool operator!=(Align Lhs, Align Rhs) {
            ^
/data/scratch/devel/creduce/work/.buildlink/include/llvm/Support/Alignment.h:330:13: note: candidate function not viable: no known conversion from 'llvm::ErrorOr<const DirectoryEntry *>' to 'llvm::Align' for 1st argument
inline bool operator!=(Align Lhs, MaybeAlign Rhs) {
            ^
/data/scratch/devel/creduce/work/.buildlink/include/llvm/Support/Alignment.h:356:13: note: candidate function not viable: no known conversion from 'llvm::ErrorOr<const DirectoryEntry *>' to 'llvm::MaybeAlign' for 1st argument
inline bool operator!=(MaybeAlign Lhs, Align Rhs) {
            ^
/data/scratch/devel/creduce/work/.buildlink/include/llvm/ADT/APInt.h:2026:13: note: candidate function not viable: no known conversion from 'llvm::ErrorOr<const DirectoryEntry *>' to 'uint64_t' (aka 'unsigned long') for 1st argument
inline bool operator!=(uint64_t V1, const APInt &V2) { return V2 != V1; }
            ^
/data/scratch/devel/creduce/work/.buildlink/include/llvm/ADT/Optional.h:305:6: note: candidate template ignored: could not match 'Optional' against 'ErrorOr'
bool operator!=(const Optional<T> &X, const Optional<U> &Y) {
     ^
/data/scratch/devel/creduce/work/.buildlink/include/llvm/ADT/Optional.h:342:6: note: candidate template ignored: could not match 'Optional' against 'ErrorOr'
bool operator!=(const Optional<T> &X, NoneType) {
     ^
/data/scratch/devel/creduce/work/.buildlink/include/llvm/ADT/Optional.h:347:6: note: candidate template ignored: could not match 'Optional<type-parameter-0-0>' against 'long'
bool operator!=(NoneType, const Optional<T> &X) {
     ^
/data/scratch/devel/creduce/work/.buildlink/include/llvm/ADT/Optional.h:391:28: note: candidate template ignored: could not match 'Optional' against 'ErrorOr'
template <typename T> bool operator!=(const Optional<T> &X, const T &Y) {
                           ^
/data/scratch/devel/creduce/work/.buildlink/include/llvm/ADT/Optional.h:395:28: note: candidate template ignored: could not match 'Optional<type-parameter-0-0>' against 'long'
template <typename T> bool operator!=(const T &X, const Optional<T> &Y) {
                           ^
/data/scratch/devel/creduce/work/.buildlink/include/llvm/ADT/IntrusiveRefCntPtr.h:202:13: note: candidate template ignored: could not match 'IntrusiveRefCntPtr' against 'ErrorOr'
inline bool operator!=(const IntrusiveRefCntPtr<T> &A,
            ^
/data/scratch/devel/creduce/work/.buildlink/include/llvm/ADT/IntrusiveRefCntPtr.h:213:13: note: candidate template ignored: could not match 'IntrusiveRefCntPtr' against 'ErrorOr'
inline bool operator!=(const IntrusiveRefCntPtr<T> &A, U *B) {
            ^
/data/scratch/devel/creduce/work/.buildlink/include/llvm/ADT/IntrusiveRefCntPtr.h:223:13: note: candidate template ignored: could not match 'T *' against 'llvm::ErrorOr<const DirectoryEntry *>'
inline bool operator!=(T *A, const IntrusiveRefCntPtr<U> &B) {
            ^
/data/scratch/devel/creduce/work/.buildlink/include/llvm/ADT/IntrusiveRefCntPtr.h:238:6: note: candidate template ignored: could not match 'IntrusiveRefCntPtr<type-parameter-0-0>' against 'long'
bool operator!=(std::nullptr_t A, const IntrusiveRefCntPtr<T> &B) {
     ^
/data/scratch/devel/creduce/work/.buildlink/include/llvm/ADT/IntrusiveRefCntPtr.h:243:6: note: candidate template ignored: could not match 'IntrusiveRefCntPtr' against 'ErrorOr'
bool operator!=(const IntrusiveRefCntPtr<T> &A, std::nullptr_t B) {
     ^
/data/scratch/devel/creduce/work/.buildlink/include/llvm/ADT/ArrayRef.h:538:15: note: candidate template ignored: could not match 'ArrayRef' against 'ErrorOr'
  inline bool operator!=(ArrayRef<T> LHS, ArrayRef<T> RHS) {
              ^
/data/scratch/devel/creduce/work/.buildlink/include/llvm/ADT/DenseMap.h:675:6: note: candidate template ignored: could not match 'DenseMapBase' against 'ErrorOr'
bool operator!=(
     ^
/data/scratch/devel/creduce/work/.buildlink/include/llvm/ADT/SmallPtrSet.h:433:6: note: candidate template ignored: could not match 'SmallPtrSetImpl' against 'ErrorOr'
bool operator!=(const SmallPtrSetImpl<PtrType> &LHS,
     ^
/data/scratch/devel/creduce/work/.buildlink/include/llvm/ADT/SmallSet.h:272:6: note: candidate template ignored: could not match 'SmallSet' against 'ErrorOr'
bool operator!=(const SmallSet<T, LN, C> &LHS, const SmallSet<T, RN, C> &RHS) {
     ^
/data/scratch/devel/creduce/work/.buildlink/include/llvm/ADT/PointerUnion.h:248:6: note: candidate template ignored: could not match 'PointerUnion' against 'ErrorOr'
bool operator!=(PointerUnion<PTs...> lhs, PointerUnion<PTs...> rhs) {
     ^
TransformationManager.cpp:136:40: error: too many arguments to function call, expected 3, have 4
                                       ClangInstance->getDiagnostics());
                                       ^~~~~~~~~~~~~~~~~~~~~~~~~~~~~~~
/data/scratch/devel/creduce/work/.buildlink/include/clang/Frontend/CompilerInvocation.h:157:15: note: 'CreateFromArgs' declared here
  static bool CreateFromArgs(CompilerInvocation &Res,
              ^
TransformationManager.cpp:138:43: error: no member named 'OpenCL' in 'clang::InputKind'
                               InputKind::OpenCL, T, PPOpts);
                               ~~~~~~~~~~~^
TransformationManager.cpp:187:22: error: member access into incomplete type 'Builtin::Context'
  PP.getBuiltinInfo().initializeBuiltins(PP.getIdentifierTable(),
                     ^
/data/scratch/devel/creduce/work/.buildlink/include/clang/Lex/Preprocessor.h:84:7: note: forward declaration of 'clang::Builtin::Context'
class Context;
      ^
2 warnings and 9 errors generated.
gmake[2]: *** [Makefile:1939: clang_delta-TransformationManager.o] Error 1
gmake[2]: *** Waiting for unfinished jobs....
mv -f .deps/clang_delta-SimpleInliner.Tpo .deps/clang_delta-SimpleInliner.Po
mv -f .deps/clang_delta-SimplifyRecursiveTemplateInstantiation.Tpo .deps/clang_delta-SimplifyRecursiveTemplateInstantiation.Po
mv -f .deps/clang_delta-SimplifyStruct.Tpo .deps/clang_delta-SimplifyStruct.Po
mv -f .deps/clang_delta-SimplifyNestedClass.Tpo .deps/clang_delta-SimplifyNestedClass.Po
mv -f .deps/clang_delta-Transformation.Tpo .deps/clang_delta-Transformation.Po
mv -f .deps/clang_delta-TemplateNonTypeArgToInt.Tpo .deps/clang_delta-TemplateNonTypeArgToInt.Po
mv -f .deps/clang_delta-TemplateArgToInt.Tpo .deps/clang_delta-TemplateArgToInt.Po
gmake[2]: Leaving directory '/data/scratch/devel/creduce/work/creduce-2.10.0/clang_delta'
gmake[1]: *** [Makefile:445: all-recursive] Error 1
gmake[1]: Leaving directory '/data/scratch/devel/creduce/work/creduce-2.10.0'
gmake: *** [Makefile:377: all] Error 2
*** Error code 2

Stop.
make[1]: stopped in /data/pkgsrc/devel/creduce
*** Error code 1

Stop.
make: stopped in /data/pkgsrc/devel/creduce