=> Bootstrap dependency digest>=20010302: found digest-20160304
===> Skipping vulnerability checks.
WARNING: No /var/db/pkg/pkg-vulnerabilities file found.
WARNING: To fix run: `/usr/sbin/pkg_admin -K /var/db/pkg fetch-pkg-vulnerabilities'.
===> Installing for screws-0.56nb21
=> Generating pre-install file lists
gmake[1]: Entering directory '/data/scratch/www/screws/work/screws-0.56/src/Server'
[O] Options
 * USE_POLL
 * USE_DEBUG
 * USE_SSL
[L] Linking...
Ssl.o: In function `SslInit':
/data/scratch/www/screws/work/screws-0.56/src/Server/Ssl.c:86: undefined reference to `SSLv3_server_method'
clang: error: linker command failed with exit code 1 (use -v to see invocation)
Makefile:27: recipe for target 'all' failed
gmake[1]: *** [all] Error 1
gmake[1]: Leaving directory '/data/scratch/www/screws/work/screws-0.56/src/Server'
cd: can't cd to src/Hsml
cd: can't cd to src/Utils
cd: can't cd to src/Modules
Build is done
==> Creating install directories
install -d -m 0755 /data/scratch/www/screws/work/.destdir/usr/pkg
install -d -m 0755 /data/scratch/www/screws/work/.destdir/usr/pkg/sbin /data/scratch/www/screws/work/.destdir/usr/pkg/bin
install -d -m 0755 /data/scratch/www/screws/work/.destdir/usr/pkg/share/doc/screws/examples
install -d -m 0755 /data/scratch/www/screws/work/.destdir/usr/pkg/share/examples/screws
install -d -m 0755 /data/scratch/www/screws/work/.destdir/usr/pkg/lib/screws/
#install -d -m 0755 /data/scratch/www/screws/work/.destdir/usr/pkg/libexec/screws/modules
install -d -m 0755 /data/scratch/www/screws/work/.destdir/usr/pkg/man/man1 /data/scratch/www/screws/work/.destdir/usr/pkg/man/man5 \
	/data/scratch/www/screws/work/.destdir/usr/pkg/man/man8 #/data/scratch/www/screws/work/.destdir/usr/pkg/etc /data/scratch/www/screws/work/.destdir/usr/pkg/var/log
==> Installing binaries
install -c -m 0755 src/Utils/screwsctl /data/scratch/www/screws/work/.destdir/usr/pkg/sbin/
install -c -m 0755 src/Server/screwsd  /data/scratch/www/screws/work/.destdir/usr/pkg/sbin/
install: src/Server/screwsd: stat: No such file or directory
Makefile:50: recipe for target 'install' failed
gmake: *** [install] Error 1
*** Error code 2

Stop.
make[1]: stopped in /data/pkgsrc/www/screws
*** Error code 1

Stop.
make: stopped in /data/pkgsrc/www/screws