=> Bootstrap dependency digest>=20010302: found digest-20160304
===> Skipping vulnerability checks.
WARNING: No /var/db/pkg/pkg-vulnerabilities file found.
WARNING: To fix run: `/usr/sbin/pkg_admin -K /var/db/pkg fetch-pkg-vulnerabilities'.
===> Building for httperf-0.9.0nb1
/usr/pkg/bin/gmake  all-recursive
gmake[1]: Entering directory '/data/scratch/benchmarks/httperf/work/httperf-0.9.0'
Making all in src
gmake[2]: Entering directory '/data/scratch/benchmarks/httperf/work/httperf-0.9.0/src'
Making all in gen
gmake[3]: Entering directory '/data/scratch/benchmarks/httperf/work/httperf-0.9.0/src/gen'
if clang -DHAVE_CONFIG_H -I. -I. -I../..    -I./.. -O2 -DFD_SETSIZE=16424 -DHAVE_SSL -MT call_seq.o -MD -MP -MF ".deps/call_seq.Tpo" -c -o call_seq.o call_seq.c; \
then mv -f ".deps/call_seq.Tpo" ".deps/call_seq.Po"; else rm -f ".deps/call_seq.Tpo"; exit 1; fi
if clang -DHAVE_CONFIG_H -I. -I. -I../..    -I./.. -O2 -DFD_SETSIZE=16424 -DHAVE_SSL -MT conn_rate.o -MD -MP -MF ".deps/conn_rate.Tpo" -c -o conn_rate.o conn_rate.c; \
then mv -f ".deps/conn_rate.Tpo" ".deps/conn_rate.Po"; else rm -f ".deps/conn_rate.Tpo"; exit 1; fi
if clang -DHAVE_CONFIG_H -I. -I. -I../..    -I./.. -O2 -DFD_SETSIZE=16424 -DHAVE_SSL -MT misc.o -MD -MP -MF ".deps/misc.Tpo" -c -o misc.o misc.c; \
then mv -f ".deps/misc.Tpo" ".deps/misc.Po"; else rm -f ".deps/misc.Tpo"; exit 1; fi
if clang -DHAVE_CONFIG_H -I. -I. -I../..    -I./.. -O2 -DFD_SETSIZE=16424 -DHAVE_SSL -MT rate.o -MD -MP -MF ".deps/rate.Tpo" -c -o rate.o rate.c; \
then mv -f ".deps/rate.Tpo" ".deps/rate.Po"; else rm -f ".deps/rate.Tpo"; exit 1; fi
if clang -DHAVE_CONFIG_H -I. -I. -I../..    -I./.. -O2 -DFD_SETSIZE=16424 -DHAVE_SSL -MT session.o -MD -MP -MF ".deps/session.Tpo" -c -o session.o session.c; \
then mv -f ".deps/session.Tpo" ".deps/session.Po"; else rm -f ".deps/session.Tpo"; exit 1; fi
if clang -DHAVE_CONFIG_H -I. -I. -I../..    -I./.. -O2 -DFD_SETSIZE=16424 -DHAVE_SSL -MT uri_fixed.o -MD -MP -MF ".deps/uri_fixed.Tpo" -c -o uri_fixed.o uri_fixed.c; \
then mv -f ".deps/uri_fixed.Tpo" ".deps/uri_fixed.Po"; else rm -f ".deps/uri_fixed.Tpo"; exit 1; fi
if clang -DHAVE_CONFIG_H -I. -I. -I../..    -I./.. -O2 -DFD_SETSIZE=16424 -DHAVE_SSL -MT uri_wlog.o -MD -MP -MF ".deps/uri_wlog.Tpo" -c -o uri_wlog.o uri_wlog.c; \
then mv -f ".deps/uri_wlog.Tpo" ".deps/uri_wlog.Po"; else rm -f ".deps/uri_wlog.Tpo"; exit 1; fi
if clang -DHAVE_CONFIG_H -I. -I. -I../..    -I./.. -O2 -DFD_SETSIZE=16424 -DHAVE_SSL -MT uri_wset.o -MD -MP -MF ".deps/uri_wset.Tpo" -c -o uri_wset.o uri_wset.c; \
then mv -f ".deps/uri_wset.Tpo" ".deps/uri_wset.Po"; else rm -f ".deps/uri_wset.Tpo"; exit 1; fi
if clang -DHAVE_CONFIG_H -I. -I. -I../..    -I./.. -O2 -DFD_SETSIZE=16424 -DHAVE_SSL -MT wsess.o -MD -MP -MF ".deps/wsess.Tpo" -c -o wsess.o wsess.c; \
then mv -f ".deps/wsess.Tpo" ".deps/wsess.Po"; else rm -f ".deps/wsess.Tpo"; exit 1; fi
if clang -DHAVE_CONFIG_H -I. -I. -I../..    -I./.. -O2 -DFD_SETSIZE=16424 -DHAVE_SSL -MT wsesslog.o -MD -MP -MF ".deps/wsesslog.Tpo" -c -o wsesslog.o wsesslog.c; \
then mv -f ".deps/wsesslog.Tpo" ".deps/wsesslog.Po"; else rm -f ".deps/wsesslog.Tpo"; exit 1; fi
if clang -DHAVE_CONFIG_H -I. -I. -I../..    -I./.. -O2 -DFD_SETSIZE=16424 -DHAVE_SSL -MT wsesspage.o -MD -MP -MF ".deps/wsesspage.Tpo" -c -o wsesspage.o wsesspage.c; \
then mv -f ".deps/wsesspage.Tpo" ".deps/wsesspage.Po"; else rm -f ".deps/wsesspage.Tpo"; exit 1; fi
if clang -DHAVE_CONFIG_H -I. -I. -I../..    -I./.. -O2 -DFD_SETSIZE=16424 -DHAVE_SSL -MT sess_cookie.o -MD -MP -MF ".deps/sess_cookie.Tpo" -c -o sess_cookie.o sess_cookie.c; \
then mv -f ".deps/sess_cookie.Tpo" ".deps/sess_cookie.Po"; else rm -f ".deps/sess_cookie.Tpo"; exit 1; fi
rm -f libgen.a
ar cru libgen.a call_seq.o conn_rate.o misc.o rate.o session.o uri_fixed.o uri_wlog.o uri_wset.o wsess.o wsesslog.o wsesspage.o sess_cookie.o 
ranlib libgen.a
gmake[3]: Leaving directory '/data/scratch/benchmarks/httperf/work/httperf-0.9.0/src/gen'
Making all in lib
gmake[3]: Entering directory '/data/scratch/benchmarks/httperf/work/httperf-0.9.0/src/lib'
if clang -DHAVE_CONFIG_H -I. -I. -I../..     -O2 -DFD_SETSIZE=16424 -DHAVE_SSL -MT getopt.o -MD -MP -MF ".deps/getopt.Tpo" -c -o getopt.o getopt.c; \
then mv -f ".deps/getopt.Tpo" ".deps/getopt.Po"; else rm -f ".deps/getopt.Tpo"; exit 1; fi
if clang -DHAVE_CONFIG_H -I. -I. -I../..     -O2 -DFD_SETSIZE=16424 -DHAVE_SSL -MT getopt1.o -MD -MP -MF ".deps/getopt1.Tpo" -c -o getopt1.o getopt1.c; \
then mv -f ".deps/getopt1.Tpo" ".deps/getopt1.Po"; else rm -f ".deps/getopt1.Tpo"; exit 1; fi
if clang -DHAVE_CONFIG_H -I. -I. -I../..     -O2 -DFD_SETSIZE=16424 -DHAVE_SSL -MT ssl_writev.o -MD -MP -MF ".deps/ssl_writev.Tpo" -c -o ssl_writev.o ssl_writev.c; \
then mv -f ".deps/ssl_writev.Tpo" ".deps/ssl_writev.Po"; else rm -f ".deps/ssl_writev.Tpo"; exit 1; fi
rm -f libutil.a
ar cru libutil.a getopt.o getopt1.o ssl_writev.o 
ranlib libutil.a
gmake[3]: Leaving directory '/data/scratch/benchmarks/httperf/work/httperf-0.9.0/src/lib'
Making all in stat
gmake[3]: Entering directory '/data/scratch/benchmarks/httperf/work/httperf-0.9.0/src/stat'
if clang -DHAVE_CONFIG_H -I. -I. -I../..    -I./.. -I./../gen -O2 -DFD_SETSIZE=16424 -DHAVE_SSL -MT basic.o -MD -MP -MF ".deps/basic.Tpo" -c -o basic.o basic.c; \
then mv -f ".deps/basic.Tpo" ".deps/basic.Po"; else rm -f ".deps/basic.Tpo"; exit 1; fi
if clang -DHAVE_CONFIG_H -I. -I. -I../..    -I./.. -I./../gen -O2 -DFD_SETSIZE=16424 -DHAVE_SSL -MT sess_stat.o -MD -MP -MF ".deps/sess_stat.Tpo" -c -o sess_stat.o sess_stat.c; \
then mv -f ".deps/sess_stat.Tpo" ".deps/sess_stat.Po"; else rm -f ".deps/sess_stat.Tpo"; exit 1; fi
if clang -DHAVE_CONFIG_H -I. -I. -I../..    -I./.. -I./../gen -O2 -DFD_SETSIZE=16424 -DHAVE_SSL -MT print_reply.o -MD -MP -MF ".deps/print_reply.Tpo" -c -o print_reply.o print_reply.c; \
then mv -f ".deps/print_reply.Tpo" ".deps/print_reply.Po"; else rm -f ".deps/print_reply.Tpo"; exit 1; fi
rm -f libstat.a
ar cru libstat.a basic.o sess_stat.o print_reply.o 
ranlib libstat.a
gmake[3]: Leaving directory '/data/scratch/benchmarks/httperf/work/httperf-0.9.0/src/stat'
gmake[3]: Entering directory '/data/scratch/benchmarks/httperf/work/httperf-0.9.0/src'
if clang -DHAVE_CONFIG_H -I. -I. -I..    -I. -I./gen -I./lib -I./stat -O2 -DFD_SETSIZE=16424 -DHAVE_SSL -MT httperf.o -MD -MP -MF ".deps/httperf.Tpo" -c -o httperf.o httperf.c; \
then mv -f ".deps/httperf.Tpo" ".deps/httperf.Po"; else rm -f ".deps/httperf.Tpo"; exit 1; fi
httperf.c:811:30: warning: implicit declaration of function 'SSLv3_client_method' is invalid in C99 [-Wimplicit-function-declaration]
      ssl_ctx = SSL_CTX_new (SSLv3_client_method ());
                             ^
httperf.c:811:30: warning: incompatible integer to pointer conversion passing 'int' to parameter of type 'const SSL_METHOD *' (aka 'const struct ssl_method_st *') [-Wint-conversion]
      ssl_ctx = SSL_CTX_new (SSLv3_client_method ());
                             ^~~~~~~~~~~~~~~~~~~~~~
/usr/include/openssl/ssl.h:1336:47: note: passing argument to parameter 'meth' here
__owur SSL_CTX *SSL_CTX_new(const SSL_METHOD *meth);
                                              ^
2 warnings generated.
if clang -DHAVE_CONFIG_H -I. -I. -I..    -I. -I./gen -I./lib -I./stat -O2 -DFD_SETSIZE=16424 -DHAVE_SSL -MT object.o -MD -MP -MF ".deps/object.Tpo" -c -o object.o object.c; \
then mv -f ".deps/object.Tpo" ".deps/object.Po"; else rm -f ".deps/object.Tpo"; exit 1; fi
if clang -DHAVE_CONFIG_H -I. -I. -I..    -I. -I./gen -I./lib -I./stat -O2 -DFD_SETSIZE=16424 -DHAVE_SSL -MT call.o -MD -MP -MF ".deps/call.Tpo" -c -o call.o call.c; \
then mv -f ".deps/call.Tpo" ".deps/call.Po"; else rm -f ".deps/call.Tpo"; exit 1; fi
if clang -DHAVE_CONFIG_H -I. -I. -I..    -I. -I./gen -I./lib -I./stat -O2 -DFD_SETSIZE=16424 -DHAVE_SSL -MT conn.o -MD -MP -MF ".deps/conn.Tpo" -c -o conn.o conn.c; \
then mv -f ".deps/conn.Tpo" ".deps/conn.Po"; else rm -f ".deps/conn.Tpo"; exit 1; fi
if clang -DHAVE_CONFIG_H -I. -I. -I..    -I. -I./gen -I./lib -I./stat -O2 -DFD_SETSIZE=16424 -DHAVE_SSL -MT sess.o -MD -MP -MF ".deps/sess.Tpo" -c -o sess.o sess.c; \
then mv -f ".deps/sess.Tpo" ".deps/sess.Po"; else rm -f ".deps/sess.Tpo"; exit 1; fi
if clang -DHAVE_CONFIG_H -I. -I. -I..    -I. -I./gen -I./lib -I./stat -O2 -DFD_SETSIZE=16424 -DHAVE_SSL -MT core.o -MD -MP -MF ".deps/core.Tpo" -c -o core.o core.c; \
then mv -f ".deps/core.Tpo" ".deps/core.Po"; else rm -f ".deps/core.Tpo"; exit 1; fi
core.c:803:18: warning: assigning to 'SSL_CIPHER *' (aka 'struct ssl_cipher_st *') from 'const SSL_CIPHER *' (aka 'const struct ssl_cipher_st *') discards qualifiers [-Wincompatible-pointer-types-discards-qualifiers]
      ssl_cipher = SSL_get_current_cipher (s->ssl);
                 ^ ~~~~~~~~~~~~~~~~~~~~~~~~~~~~~~~
core.c:809:14: error: incomplete definition of type 'struct ssl_cipher_st'
                 ssl_cipher->name, ssl_cipher->valid, ssl_cipher->id);
                 ~~~~~~~~~~^
/usr/include/openssl/ssl.h:227:16: note: forward declaration of 'struct ssl_cipher_st'
typedef struct ssl_cipher_st SSL_CIPHER;
               ^
core.c:809:32: error: incomplete definition of type 'struct ssl_cipher_st'
                 ssl_cipher->name, ssl_cipher->valid, ssl_cipher->id);
                                   ~~~~~~~~~~^
/usr/include/openssl/ssl.h:227:16: note: forward declaration of 'struct ssl_cipher_st'
typedef struct ssl_cipher_st SSL_CIPHER;
               ^
core.c:809:51: error: incomplete definition of type 'struct ssl_cipher_st'
                 ssl_cipher->name, ssl_cipher->valid, ssl_cipher->id);
                                                      ~~~~~~~~~~^
/usr/include/openssl/ssl.h:227:16: note: forward declaration of 'struct ssl_cipher_st'
typedef struct ssl_cipher_st SSL_CIPHER;
               ^
1 warning and 3 errors generated.
Makefile:287: recipe for target 'core.o' failed
gmake[3]: *** [core.o] Error 1
gmake[3]: Leaving directory '/data/scratch/benchmarks/httperf/work/httperf-0.9.0/src'
Makefile:324: recipe for target 'all-recursive' failed
gmake[2]: *** [all-recursive] Error 1
gmake[2]: Leaving directory '/data/scratch/benchmarks/httperf/work/httperf-0.9.0/src'
Makefile:256: recipe for target 'all-recursive' failed
gmake[1]: *** [all-recursive] Error 1
gmake[1]: Leaving directory '/data/scratch/benchmarks/httperf/work/httperf-0.9.0'
Makefile:185: recipe for target 'all' failed
gmake: *** [all] Error 2
*** Error code 2

Stop.
make[1]: stopped in /data/pkgsrc/benchmarks/httperf
*** Error code 1

Stop.
make: stopped in /data/pkgsrc/benchmarks/httperf