=> Bootstrap dependency digest>=20010302: found digest-20160304
WARNING: [license.mk] Every package should define a LICENSE.
===> Skipping vulnerability checks.
WARNING: No /var/db/pkg/pkg-vulnerabilities file found.
WARNING: To fix run: `/usr/sbin/pkg_admin -K /var/db/pkg fetch-pkg-vulnerabilities'.
===> Building for boxbackup-client-0.11.1nb8
(cd bin/bbackupd; gmake RELEASE=1)
gmake[1]: Entering directory '/data/scratch/sysutils/boxbackup-client/work/boxbackup-0.11.1/bin/bbackupd'
gmake[2]: Entering directory '/data/scratch/sysutils/boxbackup-client/work/boxbackup-0.11.1/lib/win32'
  [CXX]     emu.cpp
  [CXX]     getopt_long.cpp
  [AR]      ../../release/lib/win32/win32.a
  [RANLIB]  ../../release/lib/win32/win32.a
gmake[2]: Leaving directory '/data/scratch/sysutils/boxbackup-client/work/boxbackup-0.11.1/lib/win32'
gmake[2]: Entering directory '/data/scratch/sysutils/boxbackup-client/work/boxbackup-0.11.1/lib/common'
  [CXX]     BoxException.cpp
  [CXX]     BoxTime.cpp
  [CXX]     BoxTimeToText.cpp
  [CXX]     BufferedStream.cpp
  [CXX]     BufferedWriteStream.cpp
  [CXX]     CollectInBufferStream.cpp
  [CXX]     Configuration.cpp
Configuration.cpp:781:15: warning: unused variable 'r' [-Wunused-variable]
                                        uint32_t r = ::strtoul(val, &end, 0);
                                                 ^
1 warning generated.
  [CXX]     ConversionString.cpp
  [CXX]     DebugAssertFailed.cpp
  [CXX]     DebugMemLeakFinder.cpp
  [CXX]     DebugPrintf.cpp
  [CXX]     EventWatchFilesystemObject.cpp
  [CXX]     ExcludeList.cpp
  [CXX]     FdGetLine.cpp
  [CXX]     FileModificationTime.cpp
  [CXX]     FileStream.cpp
  [CXX]     IOStream.cpp
  [CXX]     IOStreamGetLine.cpp
  [CXX]     InvisibleTempFileStream.cpp
  [CXX]     Logging.cpp
  [CXX]     MemBlockStream.cpp
  [CXX]     NamedLock.cpp
  [CXX]     PartialReadStream.cpp
  [CXX]     PathUtils.cpp
  [CXX]     ReadGatherStream.cpp
  [CXX]     ReadLoggingStream.cpp
  [CXX]     StreamableMemBlock.cpp
  [CXX]     Test.cpp
  [CXX]     Timer.cpp
Timer.cpp:146:7: warning: unused variable 'result' [-Wunused-variable]
                int result = ::setitimer(ITIMER_REAL, &timeout, NULL);
                    ^
1 warning generated.
  [CXX]     UnixUser.cpp
  [CXX]     Utils.cpp
  [CXX]     WaitForEvent.cpp
  [CXX]     ZeroStream.cpp
  [CXX]     autogen_CommonException.cpp
autogen_CommonException.cpp:114:14: warning: comparison of unsigned expression < 0 is always false [-Wtautological-compare]
        if(mSubType < 0 || mSubType > (sizeof(whats) / sizeof(whats[0])))
           ~~~~~~~~ ^ ~
1 warning generated.
  [CXX]     autogen_ConversionException.cpp
autogen_ConversionException.cpp:42:14: warning: comparison of unsigned expression < 0 is always false [-Wtautological-compare]
        if(mSubType < 0 || mSubType > (sizeof(whats) / sizeof(whats[0])))
           ~~~~~~~~ ^ ~
1 warning generated.
  [AR]      ../../release/lib/common/common.a
  [RANLIB]  ../../release/lib/common/common.a
gmake[2]: Leaving directory '/data/scratch/sysutils/boxbackup-client/work/boxbackup-0.11.1/lib/common'
gmake[2]: Entering directory '/data/scratch/sysutils/boxbackup-client/work/boxbackup-0.11.1/lib/compress'
  [CXX]     CompressStream.cpp
  [CXX]     autogen_CompressException.cpp
autogen_CompressException.cpp:52:14: warning: comparison of unsigned expression < 0 is always false [-Wtautological-compare]
        if(mSubType < 0 || mSubType > (sizeof(whats) / sizeof(whats[0])))
           ~~~~~~~~ ^ ~
1 warning generated.
  [AR]      ../../release/lib/compress/compress.a
  [RANLIB]  ../../release/lib/compress/compress.a
gmake[2]: Leaving directory '/data/scratch/sysutils/boxbackup-client/work/boxbackup-0.11.1/lib/compress'
gmake[2]: Entering directory '/data/scratch/sysutils/boxbackup-client/work/boxbackup-0.11.1/lib/crypto'
  [CXX]     CipherAES.cpp
  [CXX]     CipherBlowfish.cpp
  [CXX]     CipherContext.cpp
In file included from CipherContext.cpp:73:
./CipherContext.h:130:17: error: field has incomplete type 'EVP_CIPHER_CTX' (aka 'evp_cipher_ctx_st')
        EVP_CIPHER_CTX ctx;
                       ^
/usr/include/openssl/ossl_typ.h:90:16: note: forward declaration of 'evp_cipher_ctx_st'
typedef struct evp_cipher_ctx_st EVP_CIPHER_CTX;
               ^
1 error generated.
Makefile:60: recipe for target '../../release/lib/crypto/CipherContext.o' failed
gmake[2]: *** [../../release/lib/crypto/CipherContext.o] Error 1
gmake[2]: Leaving directory '/data/scratch/sysutils/boxbackup-client/work/boxbackup-0.11.1/lib/crypto'
Makefile:49: recipe for target 'dep_modules' failed
gmake[1]: *** [dep_modules] Error 2
gmake[1]: Leaving directory '/data/scratch/sysutils/boxbackup-client/work/boxbackup-0.11.1/bin/bbackupd'
Makefile:26: recipe for target 'release/bin/bbackupd/bbackupd' failed
gmake: *** [release/bin/bbackupd/bbackupd] Error 2
*** Error code 2

Stop.
make[1]: stopped in /data/pkgsrc/sysutils/boxbackup-client
*** Error code 1

Stop.
make: stopped in /data/pkgsrc/sysutils/boxbackup-client