=> Bootstrap dependency digest>=20010302: found digest-20160304
===> Skipping vulnerability checks.
WARNING: No /var/db/pkg/pkg-vulnerabilities file found.
WARNING: To fix run: `/usr/sbin/pkg_admin -K /var/db/pkg fetch-pkg-vulnerabilities'.
===> Building for flatbuffers-1.8.0
Scanning dependencies of target flathash
Scanning dependencies of target flatbuffers_shared
Scanning dependencies of target flatbuffers
Scanning dependencies of target flatc
[  1%] Building CXX object CMakeFiles/flatbuffers_shared.dir/src/idl_gen_text.cpp.o
[  3%] Building CXX object CMakeFiles/flatbuffers_shared.dir/src/reflection.cpp.o
[  5%] Building CXX object CMakeFiles/flatbuffers_shared.dir/src/code_generators.cpp.o
[  7%] Building CXX object CMakeFiles/flatbuffers_shared.dir/src/idl_parser.cpp.o
[  9%] Building CXX object CMakeFiles/flatbuffers_shared.dir/src/util.cpp.o
[ 11%] Building CXX object CMakeFiles/flatbuffers.dir/src/idl_parser.cpp.o
[ 13%] Building CXX object CMakeFiles/flatbuffers.dir/src/code_generators.cpp.o
[ 15%] Building CXX object CMakeFiles/flatbuffers.dir/src/util.cpp.o
[ 16%] Building CXX object CMakeFiles/flatbuffers.dir/src/reflection.cpp.o
[ 18%] Building CXX object CMakeFiles/flatc.dir/src/idl_parser.cpp.o
[ 24%] Building CXX object CMakeFiles/flathash.dir/src/flathash.cpp.o
[ 20%] Building CXX object CMakeFiles/flatc.dir/src/reflection.cpp.o
[ 22%] Building CXX object CMakeFiles/flatc.dir/src/idl_gen_text.cpp.o
[ 26%] Building CXX object CMakeFiles/flatc.dir/src/util.cpp.o
[ 28%] Building CXX object CMakeFiles/flatbuffers.dir/src/idl_gen_text.cpp.o
[ 30%] Building CXX object CMakeFiles/flatc.dir/src/code_generators.cpp.o
[ 32%] Building CXX object CMakeFiles/flatc.dir/src/idl_gen_cpp.cpp.o
[ 33%] Linking CXX executable flathash
/usr/bin/ld: cannot find -lc++abi
clang: error: linker command failed with exit code 1 (use -v to see invocation)
--- flathash ---
*** [flathash] Error code 1

make[2]: stopped in /data/scratch/devel/flatbuffers/work/flatbuffers-1.8.0
1 error

make[2]: stopped in /data/scratch/devel/flatbuffers/work/flatbuffers-1.8.0
--- CMakeFiles/flathash.dir/all ---
*** [CMakeFiles/flathash.dir/all] Error code 2

make[1]: stopped in /data/scratch/devel/flatbuffers/work/flatbuffers-1.8.0
[ 35%] Building CXX object CMakeFiles/flatc.dir/src/idl_gen_general.cpp.o
A failure has been detected in another branch of the parallel make

make[2]: stopped in /data/scratch/devel/flatbuffers/work/flatbuffers-1.8.0
--- CMakeFiles/flatc.dir/all ---
*** [CMakeFiles/flatc.dir/all] Error code 2

make[1]: stopped in /data/scratch/devel/flatbuffers/work/flatbuffers-1.8.0
A failure has been detected in another branch of the parallel make

make[2]: stopped in /data/scratch/devel/flatbuffers/work/flatbuffers-1.8.0
--- CMakeFiles/flatbuffers.dir/all ---
*** [CMakeFiles/flatbuffers.dir/all] Error code 2

make[1]: stopped in /data/scratch/devel/flatbuffers/work/flatbuffers-1.8.0
A failure has been detected in another branch of the parallel make

make[2]: stopped in /data/scratch/devel/flatbuffers/work/flatbuffers-1.8.0
--- CMakeFiles/flatbuffers_shared.dir/all ---
*** [CMakeFiles/flatbuffers_shared.dir/all] Error code 2

make[1]: stopped in /data/scratch/devel/flatbuffers/work/flatbuffers-1.8.0
4 errors

make[1]: stopped in /data/scratch/devel/flatbuffers/work/flatbuffers-1.8.0
*** [all] Error code 2

make: stopped in /data/scratch/devel/flatbuffers/work/flatbuffers-1.8.0
1 error

make: stopped in /data/scratch/devel/flatbuffers/work/flatbuffers-1.8.0
*** Error code 2

Stop.
make[1]: stopped in /data/pkgsrc/devel/flatbuffers
*** Error code 1

Stop.
make: stopped in /data/pkgsrc/devel/flatbuffers