=> Bootstrap dependency digest>=20010302: found digest-20160304
WARNING: [license.mk] Every package should define a LICENSE.
===> Skipping vulnerability checks.
WARNING: No /var/db/pkg/pkg-vulnerabilities file found.
WARNING: To fix run: `/usr/sbin/pkg_admin -K /var/db/pkg fetch-pkg-vulnerabilities'.
===> Building for xf86-video-r128-6.10.2
/usr/pkg/bin/gmake  all-recursive
gmake[1]: Entering directory '/data/scratch/x11/xf86-video-r128/work/xf86-video-r128-6.10.2'
Making all in src
gmake[2]: Entering directory '/data/scratch/x11/xf86-video-r128/work/xf86-video-r128-6.10.2/src'
  CC       r128_accel.lo
  CC       r128_cursor.lo
  CC       r128_video.lo
  CC       r128_driver.lo
r128_driver.c: In function 'R128ScreenInit':
r128_driver.c:1610:27: warning: unused variable 'osArea' [-Wunused-variable]
     ExaOffscreenArea*     osArea = NULL;
                           ^
r128_driver.c:1607:33: warning: unused variable 'y1' [-Wunused-variable]
     int         x1 = 0, x2 = 0, y1 = 0, y2 = 0;
                                 ^
r128_driver.c:1607:25: warning: unused variable 'x2' [-Wunused-variable]
     int         x1 = 0, x2 = 0, y1 = 0, y2 = 0;
                         ^
r128_driver.c:1607:17: warning: unused variable 'x1' [-Wunused-variable]
     int         x1 = 0, x2 = 0, y1 = 0, y2 = 0;
                 ^
  CC       r128_misc.lo
  CC       r128_crtc.lo
  CC       r128_output.lo
  CC       r128_probe.lo
  CC       r128_exa.lo
  CC       r128_dri.lo
r128_dri.c:62:19: fatal error: sarea.h: No such file or directory
 #include "sarea.h"
                   ^
compilation terminated.
Makefile:512: recipe for target 'r128_dri.lo' failed
gmake[2]: *** [r128_dri.lo] Error 1
gmake[2]: *** Waiting for unfinished jobs....
gmake[2]: Leaving directory '/data/scratch/x11/xf86-video-r128/work/xf86-video-r128-6.10.2/src'
Makefile:444: recipe for target 'all-recursive' failed
gmake[1]: *** [all-recursive] Error 1
gmake[1]: Leaving directory '/data/scratch/x11/xf86-video-r128/work/xf86-video-r128-6.10.2'
Makefile:376: recipe for target 'all' failed
gmake: *** [all] Error 2
*** Error code 2

Stop.
make[1]: stopped in /data/pkgsrc-current/x11/xf86-video-r128
*** Error code 1

Stop.
make: stopped in /data/pkgsrc-current/x11/xf86-video-r128