=> Bootstrap dependency digest>=20010302: found digest-20160304
WARNING: [license.mk] Every package should define a LICENSE.
===> Skipping vulnerability checks.
WARNING: No /var/db/pkg/pkg-vulnerabilities file found.
WARNING: To fix run: `/usr/sbin/pkg_admin -K /var/db/pkg fetch-pkg-vulnerabilities'.
===> Building for xf86-video-mach64-6.9.5nb1
/usr/pkg/bin/gmake  all-recursive
gmake[1]: Entering directory '/data/scratch/x11/xf86-video-mach64/work/xf86-video-mach64-6.9.5'
Making all in src
gmake[2]: Entering directory '/data/scratch/x11/xf86-video-mach64/work/xf86-video-mach64-6.9.5/src'
  CC       atibus.lo
  CC       atividmem.lo
  CC       atiprobe.lo
  CC       atichip.lo
In file included from atividmem.c:28:0:
atistruct.h:42:19: fatal error: sarea.h: No such file or directory
 #include "sarea.h"
                   ^
compilation terminated.
Makefile:599: recipe for target 'atividmem.lo' failed
gmake[2]: *** [atividmem.lo] Error 1
gmake[2]: *** Waiting for unfinished jobs....
In file included from atimach64io.h:37:0,
                 from atiprobe.c:34:
atistruct.h:42:19: fatal error: sarea.h: No such file or directory
 #include "sarea.h"
                   ^
compilation terminated.
In file included from atimach64io.h:37:0,
                 from atibus.c:32:
atistruct.h:42:19: fatal error: sarea.h: No such file or directory
 #include "sarea.h"
                   ^
compilation terminated.
Makefile:599: recipe for target 'atiprobe.lo' failed
gmake[2]: *** [atiprobe.lo] Error 1
Makefile:599: recipe for target 'atibus.lo' failed
gmake[2]: *** [atibus.lo] Error 1
In file included from atimach64io.h:37:0,
                 from atichip.c:30:
atistruct.h:42:19: fatal error: sarea.h: No such file or directory
 #include "sarea.h"
                   ^
compilation terminated.
Makefile:599: recipe for target 'atichip.lo' failed
gmake[2]: *** [atichip.lo] Error 1
gmake[2]: Leaving directory '/data/scratch/x11/xf86-video-mach64/work/xf86-video-mach64-6.9.5/src'
Makefile:443: recipe for target 'all-recursive' failed
gmake[1]: *** [all-recursive] Error 1
gmake[1]: Leaving directory '/data/scratch/x11/xf86-video-mach64/work/xf86-video-mach64-6.9.5'
Makefile:375: recipe for target 'all' failed
gmake: *** [all] Error 2
*** Error code 2

Stop.
make[1]: stopped in /data/pkgsrc-current/x11/xf86-video-mach64
*** Error code 1

Stop.
make: stopped in /data/pkgsrc-current/x11/xf86-video-mach64