=> Bootstrap dependency digest>=20010302: found digest-20160304
WARNING: [license.mk] Every package should define a LICENSE.
===> Skipping vulnerability checks.
WARNING: No /var/db/pkg/pkg-vulnerabilities file found.
WARNING: To fix run: `/usr/sbin/pkg_admin -K /var/db/pkg fetch-pkg-vulnerabilities'.
===> Building for xf86-video-ati6-6.14.6nb6
/usr/pkg/bin/gmake  all-recursive
gmake[1]: Entering directory '/data/scratch/x11/xf86-video-ati6/work/xf86-video-ati-6.14.6'
Making all in src
gmake[2]: Entering directory '/data/scratch/x11/xf86-video-ati6/work/xf86-video-ati-6.14.6/src'
  CC       atimodule.lo
  CC       ati.lo
  CC       radeon_cursor.lo
  CC       radeon_accel.lo
In file included from radeon_cursor.c:54:0:
radeon.h:76:17: fatal error: dri.h: No such file or directory
 #include "dri.h"
                 ^
compilation terminated.
Makefile:900: recipe for target 'radeon_cursor.lo' failed
gmake[2]: *** [radeon_cursor.lo] Error 1
gmake[2]: *** Waiting for unfinished jobs....
In file included from radeon_accel.c:80:0:
radeon.h:76:17: fatal error: dri.h: No such file or directory
 #include "dri.h"
                 ^
compilation terminated.
Makefile:900: recipe for target 'radeon_accel.lo' failed
gmake[2]: *** [radeon_accel.lo] Error 1
gmake[2]: Leaving directory '/data/scratch/x11/xf86-video-ati6/work/xf86-video-ati-6.14.6/src'
Makefile:448: recipe for target 'all-recursive' failed
gmake[1]: *** [all-recursive] Error 1
gmake[1]: Leaving directory '/data/scratch/x11/xf86-video-ati6/work/xf86-video-ati-6.14.6'
Makefile:380: recipe for target 'all' failed
gmake: *** [all] Error 2
*** Error code 2

Stop.
make[1]: stopped in /data/pkgsrc-current/x11/xf86-video-ati6
*** Error code 1

Stop.
make: stopped in /data/pkgsrc-current/x11/xf86-video-ati6