=> Bootstrap dependency digest>=20010302: found digest-20160304
===> Skipping vulnerability checks.
WARNING: No /var/db/pkg/pkg-vulnerabilities file found.
WARNING: To fix run: `/usr/sbin/pkg_admin -K /var/db/pkg fetch-pkg-vulnerabilities'.
===> Building for mariadb-client-5.5.52
Scanning dependencies of target INFO_SRC
Scanning dependencies of target INFO_BIN
[  0%] Built target INFO_SRC
[  0%] Built target INFO_BIN
Scanning dependencies of target dbug-unit-tests
Scanning dependencies of target regex
[  1%] Building C object regex/CMakeFiles/regex.dir/regcomp.c.o
[  1%] Generating dbug-t
[  1%] Built target dbug-unit-tests
[  1%] Building C object regex/CMakeFiles/regex.dir/regerror.c.o
Scanning dependencies of target vio
[  1%] Building C object vio/CMakeFiles/vio.dir/vio.c.o
[  1%] Building C object vio/CMakeFiles/vio.dir/viosocket.c.o
[  1%] Building C object regex/CMakeFiles/regex.dir/regexec.c.o
Scanning dependencies of target strings
[  2%] Building C object vio/CMakeFiles/vio.dir/viossl.c.o
Scanning dependencies of target innochecksum
[  3%] Building C object extra/CMakeFiles/innochecksum.dir/innochecksum.c.o
[  3%] Building C object strings/CMakeFiles/strings.dir/bchange.c.o
[  3%] Building C object vio/CMakeFiles/vio.dir/viosslfactories.c.o
[  3%] Building C object strings/CMakeFiles/strings.dir/bmove_upp.c.o
[  3%] Linking C executable innochecksum
[  3%] Built target innochecksum
[  4%] Building C object regex/CMakeFiles/regex.dir/regfree.c.o
[  5%] Building C object strings/CMakeFiles/strings.dir/ctype-big5.c.o
[  6%] Linking C static library libvio.a
Scanning dependencies of target mysqlservices
[  6%] Built target vio
[  6%] Building C object strings/CMakeFiles/strings.dir/ctype-bin.c.o
Scanning dependencies of target comp_sql
[  7%] Building C object scripts/CMakeFiles/comp_sql.dir/comp_sql.c.o
[  8%] Building C object libservices/CMakeFiles/mysqlservices.dir/my_snprintf_service.c.o
[  8%] Building C object regex/CMakeFiles/regex.dir/reginit.c.o
[  8%] Linking C static library libregex.a
[  8%] Building C object libservices/CMakeFiles/mysqlservices.dir/thd_alloc_service.c.o
[  8%] Linking C executable comp_sql
[  8%] Building C object libservices/CMakeFiles/mysqlservices.dir/thd_wait_service.c.o
[  9%] Building C object libservices/CMakeFiles/mysqlservices.dir/my_thread_scheduler_service.c.o
[  9%] Building C object libservices/CMakeFiles/mysqlservices.dir/progress_report_service.c.o
[ 10%] Building C object libservices/CMakeFiles/mysqlservices.dir/debug_sync_service.c.o
[ 10%] Building C object strings/CMakeFiles/strings.dir/ctype-cp932.c.o
[ 10%] Building C object libservices/CMakeFiles/mysqlservices.dir/kill_statement_service.c.o
[ 10%] Built target comp_sql
[ 10%] Built target regex
[ 11%] Building C object strings/CMakeFiles/strings.dir/ctype-czech.c.o
[ 11%] Building C object libservices/CMakeFiles/mysqlservices.dir/logger_service.c.o
[ 11%] Building C object strings/CMakeFiles/strings.dir/ctype-euc_kr.c.o
[ 12%] Linking C static library libmysqlservices.a
[ 12%] Built target mysqlservices
[ 12%] Building C object strings/CMakeFiles/strings.dir/ctype-eucjpms.c.o
Scanning dependencies of target GenFixPrivs
[ 12%] Generating mysql_fix_privilege_tables_sql.c
[ 12%] Built target GenFixPrivs
[ 13%] Building C object strings/CMakeFiles/strings.dir/ctype-extra.c.o
[ 13%] Building C object strings/CMakeFiles/strings.dir/ctype-gb2312.c.o
[ 14%] Building C object strings/CMakeFiles/strings.dir/ctype-gbk.c.o
[ 14%] Building C object strings/CMakeFiles/strings.dir/ctype-mb.c.o
[ 14%] Building C object strings/CMakeFiles/strings.dir/ctype-latin1.c.o
[ 15%] Building C object strings/CMakeFiles/strings.dir/ctype-simple.c.o
[ 15%] Building C object strings/CMakeFiles/strings.dir/ctype-sjis.c.o
[ 15%] Building C object strings/CMakeFiles/strings.dir/ctype-tis620.c.o
[ 16%] Building C object strings/CMakeFiles/strings.dir/ctype-uca.c.o
[ 16%] Building C object strings/CMakeFiles/strings.dir/ctype-ucs2.c.o
[ 16%] Building C object strings/CMakeFiles/strings.dir/ctype-ujis.c.o
[ 17%] Building C object strings/CMakeFiles/strings.dir/ctype-utf8.c.o
[ 17%] Building C object strings/CMakeFiles/strings.dir/ctype-win1250ch.c.o
[ 18%] Building C object strings/CMakeFiles/strings.dir/ctype.c.o
[ 18%] Building C object strings/CMakeFiles/strings.dir/decimal.c.o
[ 18%] Building C object strings/CMakeFiles/strings.dir/dtoa.c.o
[ 18%] Building C object strings/CMakeFiles/strings.dir/is_prefix.c.o
[ 19%] Building C object strings/CMakeFiles/strings.dir/int2str.c.o
[ 19%] Building C object strings/CMakeFiles/strings.dir/llstr.c.o
[ 20%] Building C object strings/CMakeFiles/strings.dir/longlong2str.c.o
[ 20%] Building C object strings/CMakeFiles/strings.dir/my_strtoll10.c.o
[ 20%] Building C object strings/CMakeFiles/strings.dir/my_vsnprintf.c.o
[ 21%] Building C object strings/CMakeFiles/strings.dir/str2int.c.o
[ 21%] Building C object strings/CMakeFiles/strings.dir/str_alloc.c.o
[ 22%] Building C object strings/CMakeFiles/strings.dir/strcend.c.o
[ 22%] Building C object strings/CMakeFiles/strings.dir/strmov.c.o
[ 22%] Building C object strings/CMakeFiles/strings.dir/strnmov.c.o
[ 23%] Building C object strings/CMakeFiles/strings.dir/strmake.c.o
[ 23%] Building C object strings/CMakeFiles/strings.dir/strend.c.o
[ 23%] Building C object strings/CMakeFiles/strings.dir/strxnmov.c.o
[ 24%] Building C object strings/CMakeFiles/strings.dir/strxmov.c.o
[ 24%] Building C object strings/CMakeFiles/strings.dir/xml.c.o
[ 25%] Building C object strings/CMakeFiles/strings.dir/strmov_overlapp.c.o
[ 25%] Building C object strings/CMakeFiles/strings.dir/strfill.c.o
[ 25%] Building C object strings/CMakeFiles/strings.dir/my_strchr.c.o
[ 26%] Building C object strings/CMakeFiles/strings.dir/strcont.c.o
[ 26%] Building C object strings/CMakeFiles/strings.dir/strappend.c.o
[ 26%] Linking C static library libstrings.a
[ 26%] Built target strings
Scanning dependencies of target mysys
[ 27%] Building C object mysys/CMakeFiles/mysys.dir/charset-def.c.o
[ 27%] Building C object mysys/CMakeFiles/mysys.dir/checksum.c.o
[ 27%] Building C object mysys/CMakeFiles/mysys.dir/array.c.o
[ 27%] Building C object mysys/CMakeFiles/mysys.dir/charset.c.o
[ 27%] Building C object mysys/CMakeFiles/mysys.dir/errors.c.o
[ 27%] Building C object mysys/CMakeFiles/mysys.dir/hash.c.o
[ 28%] Building C object mysys/CMakeFiles/mysys.dir/list.c.o
[ 29%] Building C object mysys/CMakeFiles/mysys.dir/default.c.o
[ 29%] Building C object mysys/CMakeFiles/mysys.dir/md5.c.o
[ 29%] Building C object mysys/CMakeFiles/mysys.dir/mf_cache.c.o
[ 30%] Building C object mysys/CMakeFiles/mysys.dir/mf_dirname.c.o
[ 30%] Building C object mysys/CMakeFiles/mysys.dir/mf_fn_ext.c.o
[ 31%] Building C object mysys/CMakeFiles/mysys.dir/mf_format.c.o
[ 31%] Building C object mysys/CMakeFiles/mysys.dir/mf_getdate.c.o
[ 31%] Building C object mysys/CMakeFiles/mysys.dir/mf_iocache.c.o
[ 32%] Building C object mysys/CMakeFiles/mysys.dir/mf_iocache2.c.o
[ 32%] Building C object mysys/CMakeFiles/mysys.dir/mf_keycache.c.o
[ 32%] Building C object mysys/CMakeFiles/mysys.dir/mf_keycaches.c.o
[ 33%] Building C object mysys/CMakeFiles/mysys.dir/mf_loadpath.c.o
[ 33%] Building C object mysys/CMakeFiles/mysys.dir/mf_pack.c.o
[ 33%] Building C object mysys/CMakeFiles/mysys.dir/mf_path.c.o
[ 34%] Building C object mysys/CMakeFiles/mysys.dir/mf_qsort.c.o
[ 34%] Building C object mysys/CMakeFiles/mysys.dir/mf_qsort2.c.o
[ 35%] Building C object mysys/CMakeFiles/mysys.dir/mf_radix.c.o
[ 35%] Building C object mysys/CMakeFiles/mysys.dir/mf_same.c.o
[ 35%] Building C object mysys/CMakeFiles/mysys.dir/mf_sort.c.o
[ 36%] Building C object mysys/CMakeFiles/mysys.dir/mf_soundex.c.o
[ 36%] Building C object mysys/CMakeFiles/mysys.dir/mf_arr_appstr.c.o
[ 36%] Building C object mysys/CMakeFiles/mysys.dir/mf_tempdir.c.o
[ 37%] Building C object mysys/CMakeFiles/mysys.dir/mf_tempfile.c.o
[ 37%] Building C object mysys/CMakeFiles/mysys.dir/mf_unixpath.c.o
[ 37%] Building C object mysys/CMakeFiles/mysys.dir/mf_wcomp.c.o
[ 38%] Building C object mysys/CMakeFiles/mysys.dir/mulalloc.c.o
[ 38%] Building C object mysys/CMakeFiles/mysys.dir/my_access.c.o
[ 39%] Building C object mysys/CMakeFiles/mysys.dir/my_aes.c.o
[ 39%] Building C object mysys/CMakeFiles/mysys.dir/my_alloc.c.o
[ 39%] Building C object mysys/CMakeFiles/mysys.dir/my_bit.c.o
[ 40%] Building C object mysys/CMakeFiles/mysys.dir/my_bitmap.c.o
[ 40%] Building C object mysys/CMakeFiles/mysys.dir/my_chsize.c.o
[ 40%] Building C object mysys/CMakeFiles/mysys.dir/my_compress.c.o
[ 41%] Building C object mysys/CMakeFiles/mysys.dir/my_copy.c.o
[ 41%] Building C object mysys/CMakeFiles/mysys.dir/my_create.c.o
[ 41%] Building C object mysys/CMakeFiles/mysys.dir/my_delete.c.o
[ 42%] Building C object mysys/CMakeFiles/mysys.dir/my_div.c.o
[ 43%] Building C object mysys/CMakeFiles/mysys.dir/my_file.c.o
[ 43%] Building C object mysys/CMakeFiles/mysys.dir/my_fopen.c.o
[ 43%] Building C object mysys/CMakeFiles/mysys.dir/my_fstream.c.o
[ 43%] Building C object mysys/CMakeFiles/mysys.dir/my_error.c.o
[ 44%] Building C object mysys/CMakeFiles/mysys.dir/my_gethwaddr.c.o
[ 44%] Building C object mysys/CMakeFiles/mysys.dir/my_getopt.c.o
[ 44%] Building C object mysys/CMakeFiles/mysys.dir/my_getsystime.c.o
[ 45%] Building C object mysys/CMakeFiles/mysys.dir/my_getwd.c.o
[ 45%] Building C object mysys/CMakeFiles/mysys.dir/my_compare.c.o
[ 45%] Building C object mysys/CMakeFiles/mysys.dir/my_init.c.o
[ 46%] Building C object mysys/CMakeFiles/mysys.dir/my_lib.c.o
[ 46%] Building C object mysys/CMakeFiles/mysys.dir/my_lock.c.o
[ 47%] Building C object mysys/CMakeFiles/mysys.dir/my_malloc.c.o
[ 47%] Building C object mysys/CMakeFiles/mysys.dir/my_mess.c.o
[ 47%] Building C object mysys/CMakeFiles/mysys.dir/my_mkdir.c.o
[ 48%] Building C object mysys/CMakeFiles/mysys.dir/my_mmap.c.o
[ 48%] Building C object mysys/CMakeFiles/mysys.dir/my_once.c.o
[ 48%] Building C object mysys/CMakeFiles/mysys.dir/my_open.c.o
[ 49%] Building C object mysys/CMakeFiles/mysys.dir/my_pread.c.o
[ 49%] Building C object mysys/CMakeFiles/mysys.dir/my_pthread.c.o
[ 49%] Building C object mysys/CMakeFiles/mysys.dir/my_quick.c.o
[ 50%] Building C object mysys/CMakeFiles/mysys.dir/my_read.c.o
[ 50%] Building C object mysys/CMakeFiles/mysys.dir/my_redel.c.o
[ 51%] Building C object mysys/CMakeFiles/mysys.dir/my_rename.c.o
[ 51%] Building C object mysys/CMakeFiles/mysys.dir/my_seek.c.o
[ 51%] Building C object mysys/CMakeFiles/mysys.dir/my_sleep.c.o
[ 52%] Building C object mysys/CMakeFiles/mysys.dir/my_static.c.o
[ 53%] Building C object mysys/CMakeFiles/mysys.dir/my_sync.c.o
[ 53%] Building C object mysys/CMakeFiles/mysys.dir/my_symlink2.c.o
[ 53%] Building C object mysys/CMakeFiles/mysys.dir/my_symlink.c.o
[ 53%] Building C object mysys/CMakeFiles/mysys.dir/my_thr_init.c.o
[ 53%] Building C object mysys/CMakeFiles/mysys.dir/my_basename.c.o
[ 54%] Building C object mysys/CMakeFiles/mysys.dir/my_write.c.o
[ 54%] Building C object mysys/CMakeFiles/mysys.dir/ptr_cmp.c.o
[ 55%] Building C object mysys/CMakeFiles/mysys.dir/queues.c.o
[ 55%] Building C object mysys/CMakeFiles/mysys.dir/stacktrace.c.o
[ 55%] Building C object mysys/CMakeFiles/mysys.dir/rijndael.c.o
[ 56%] Building C object mysys/CMakeFiles/mysys.dir/sha1.c.o
[ 56%] Building C object mysys/CMakeFiles/mysys.dir/string.c.o
[ 56%] Building C object mysys/CMakeFiles/mysys.dir/thr_alarm.c.o
[ 57%] Building C object mysys/CMakeFiles/mysys.dir/thr_lock.c.o
[ 57%] Building C object mysys/CMakeFiles/mysys.dir/thr_mutex.c.o
[ 57%] Building C object mysys/CMakeFiles/mysys.dir/thr_rwlock.c.o
[ 58%] Building C object mysys/CMakeFiles/mysys.dir/base64.c.o
[ 59%] Building C object mysys/CMakeFiles/mysys.dir/tree.c.o
[ 59%] Building C object mysys/CMakeFiles/mysys.dir/typelib.c.o
[ 59%] Building C object mysys/CMakeFiles/mysys.dir/my_memmem.c.o
[ 59%] Building C object mysys/CMakeFiles/mysys.dir/my_getpagesize.c.o
[ 60%] Building C object mysys/CMakeFiles/mysys.dir/lf_alloc-pin.c.o
[ 60%] Building C object mysys/CMakeFiles/mysys.dir/lf_dynarray.c.o
[ 61%] Building C object mysys/CMakeFiles/mysys.dir/safemalloc.c.o
[ 61%] Building C object mysys/CMakeFiles/mysys.dir/lf_hash.c.o
[ 61%] Building CXX object mysys/CMakeFiles/mysys.dir/my_new.cc.o
[ 61%] Building C object mysys/CMakeFiles/mysys.dir/my_atomic.c.o
[ 62%] Building C object mysys/CMakeFiles/mysys.dir/my_getncpus.c.o
[ 62%] Building C object mysys/CMakeFiles/mysys.dir/my_safehash.c.o
[ 63%] Building C object mysys/CMakeFiles/mysys.dir/my_chmod.c.o
[ 63%] Building C object mysys/CMakeFiles/mysys.dir/my_rnd.c.o
[ 63%] Building C object mysys/CMakeFiles/mysys.dir/my_uuid.c.o
[ 64%] Building C object mysys/CMakeFiles/mysys.dir/waiting_threads.c.o
[ 64%] Building C object mysys/CMakeFiles/mysys.dir/wqueue.c.o
[ 65%] Building C object mysys/CMakeFiles/mysys.dir/my_rdtsc.c.o
[ 65%] Building C object mysys/CMakeFiles/mysys.dir/my_context.c.o
[ 65%] Building C object mysys/CMakeFiles/mysys.dir/ma_dyncol.c.o
[ 65%] Building C object mysys/CMakeFiles/mysys.dir/file_logger.c.o
[ 66%] Building C object mysys/CMakeFiles/mysys.dir/my_addr_resolve.c.o
[ 66%] Building C object mysys/CMakeFiles/mysys.dir/my_alarm.c.o
[ 67%] Building C object mysys/CMakeFiles/mysys.dir/my_lockmem.c.o
[ 67%] Linking CXX static library libmysys.a
[ 67%] Built target mysys
Scanning dependencies of target dbug
[ 68%] Building C object dbug/CMakeFiles/dbug.dir/dbug.c.o
[ 68%] Linking CXX static library libdbug.a
[ 68%] Built target dbug
Scanning dependencies of target tests
[ 69%] Building C object dbug/CMakeFiles/tests.dir/tests.c.o
Scanning dependencies of target comp_err
Scanning dependencies of target thr_lock
Scanning dependencies of target factorial
[ 69%] Building C object mysys/CMakeFiles/thr_lock.dir/thr_lock.c.o
[ 70%] Building C object dbug/CMakeFiles/factorial.dir/my_main.c.o
[ 70%] Linking CXX executable tests
[ 70%] Built target tests
[ 70%] Building C object dbug/CMakeFiles/factorial.dir/factorial.c.o
[ 70%] Building C object extra/CMakeFiles/comp_err.dir/comp_err.c.o
Scanning dependencies of target my_print_defaults
[ 70%] Linking CXX executable factorial
[ 70%] Building C object extra/CMakeFiles/my_print_defaults.dir/my_print_defaults.c.o
[ 70%] Built target factorial
Scanning dependencies of target mysql_waitpid
[ 70%] Building C object extra/CMakeFiles/mysql_waitpid.dir/mysql_waitpid.c.o
[ 71%] Linking CXX executable my_print_defaults
[ 71%] Linking CXX executable mysql_waitpid
[ 71%] Built target mysql_waitpid
[ 71%] Linking CXX executable comp_err
Scanning dependencies of target resolveip
[ 72%] Linking CXX executable thr_lock
[ 72%] Building C object extra/CMakeFiles/resolveip.dir/resolveip.c.o
[ 72%] Built target comp_err
[ 72%] Built target my_print_defaults
[ 72%] Built target thr_lock
Scanning dependencies of target resolve_stack_dump
Scanning dependencies of target replace
Scanning dependencies of target ps
[ 73%] Building C object extra/CMakeFiles/replace.dir/replace.c.o
[ 73%] Building C object extra/CMakeFiles/resolve_stack_dump.dir/resolve_stack_dump.c.o
[ 73%] Generating example3.r
[ 74%] Linking CXX executable resolveip
[ 75%] Linking CXX executable resolve_stack_dump
[ 75%] Generating output1.r, output2.r, output3.r, output4.r, output5.r
[ 75%] Built target resolveip
[ 76%] Generating factorial.r
[ 76%] Generating main.r
[ 76%] Generating example1.r
Scanning dependencies of target t
[ 77%] Generating example2.r
[ 77%] Generating example2.r
[ 77%] Generating user.t
[ 77%] Generating user.ps
[ 77%] Built target ps
[ 79%] Built target t
Scanning dependencies of target GenError
[ 79%] Generating ../include/mysqld_error.h.tmp
[ 79%] Built target resolve_stack_dump
[ 79%] Linking CXX executable replace
[ 79%] Built target replace
[ 79%] Built target GenError
Scanning dependencies of target perror
[ 79%] Building C object extra/CMakeFiles/perror.dir/perror.c.o
Scanning dependencies of target clientlib
[ 79%] Building C object libmysql/CMakeFiles/clientlib.dir/get_password.c.o
[ 80%] Building C object libmysql/CMakeFiles/clientlib.dir/errmsg.c.o
[ 80%] Building C object libmysql/CMakeFiles/clientlib.dir/libmysql.c.o
[ 80%] Building C object libmysql/CMakeFiles/clientlib.dir/__/sql-common/client.c.o
[ 81%] Linking CXX executable perror
[ 82%] Building C object libmysql/CMakeFiles/clientlib.dir/__/sql-common/mysql_async.c.o
[ 82%] Built target perror
[ 82%] Building C object libmysql/CMakeFiles/clientlib.dir/__/sql-common/my_time.c.o
[ 82%] Building C object libmysql/CMakeFiles/clientlib.dir/__/sql-common/client_plugin.c.o
[ 83%] Building CXX object libmysql/CMakeFiles/clientlib.dir/__/sql/net_serv.cc.o
[ 83%] Building C object libmysql/CMakeFiles/clientlib.dir/__/sql-common/pack.c.o
[ 83%] Building C object libmysql/CMakeFiles/clientlib.dir/__/sql/password.c.o
[ 84%] Linking CXX static library libclientlib.a
[ 84%] Built target clientlib
Scanning dependencies of target libmysql
[ 84%] Building CXX object libmysql/CMakeFiles/libmysql.dir/libmysql_exports_file.cc.o
[ 85%] Generating mysqlclient_depends.c
[ 86%] Linking CXX shared library libmysqlclient.so
Scanning dependencies of target mysqlclient
[ 86%] Building C object libmysql/CMakeFiles/mysqlclient.dir/mysqlclient_depends.c.o
[ 87%] Linking C static library libmysqlclient.a
[ 87%] Built target libmysql
Scanning dependencies of target symlink_libmysqlclient_r.so
Scanning dependencies of target symlink_libmysqlclient_r.so.18.0.0
[ 87%] Generating libmysqlclient_r.so
Scanning dependencies of target symlink_libmysqlclient_r.so.18
[ 87%] Generating libmysqlclient_r.so.18
[ 87%] Built target symlink_libmysqlclient_r.so
[ 88%] Generating libmysqlclient_r.so.18.0.0
[ 88%] Built target symlink_libmysqlclient_r.so.18
[ 88%] Built target symlink_libmysqlclient_r.so.18.0.0
/usr/bin/ar: creating /data/scratch/databases/mariadb55-client/work/mariadb-5.5.52/libmysql/libmysqlclient.a
[ 88%] Built target mysqlclient
Scanning dependencies of target symlink_libmysqlclient_r.a
Scanning dependencies of target async_example
[ 89%] Generating libmysqlclient_r.a
[ 90%] Building C object client/CMakeFiles/async_example.dir/async_example.c.o
Scanning dependencies of target mysqlslap
[ 91%] Building C object client/CMakeFiles/mysqlslap.dir/mysqlslap.c.o
Scanning dependencies of target mysqltest
[ 91%] Built target symlink_libmysqlclient_r.a
[ 91%] Linking C executable async_example
[ 91%] Building CXX object client/CMakeFiles/mysqltest.dir/mysqltest.cc.o
Scanning dependencies of target mysql_plugin
[ 91%] Built target async_example
[ 91%] Building C object client/CMakeFiles/mysql_plugin.dir/mysql_plugin.c.o
[ 91%] Linking CXX executable mysqlslap
[ 91%] Built target mysqlslap
Scanning dependencies of target mysql
[ 91%] Building CXX object client/CMakeFiles/mysql.dir/completion_hash.cc.o
[ 92%] Linking CXX executable mysql_plugin
Scanning dependencies of target mysqlcheck
[ 92%] Building CXX object client/CMakeFiles/mysql.dir/mysql.cc.o
[ 92%] Built target mysql_plugin
[ 93%] Building CXX object client/CMakeFiles/mysql.dir/readline.cc.o
[ 93%] Building C object client/CMakeFiles/mysqlcheck.dir/mysqlcheck.c.o
/data/scratch/databases/mariadb55-client/work/mariadb-5.5.52/client/mysql.cc: In function 'void initialize_readline(char*)':
/data/scratch/databases/mariadb55-client/work/mariadb-5.5.52/client/mysql.cc:2641:38: error: 'rl_completion_func_t' was not declared in this scope
   rl_attempted_completion_function= (rl_completion_func_t*)&new_mysql_completion;
                                      ^
/data/scratch/databases/mariadb55-client/work/mariadb-5.5.52/client/mysql.cc:2641:59: error: expected primary-expression before ')' token
   rl_attempted_completion_function= (rl_completion_func_t*)&new_mysql_completion;
                                                           ^
/data/scratch/databases/mariadb55-client/work/mariadb-5.5.52/client/mysql.cc:2642:31: warning: invalid conversion from 'char* (*)(const char*, int)' to 'int (*)(const char*, int)' [-fpermissive]
   rl_completion_entry_function= (rl_compentry_func_t*)&no_completion;
                               ^
/data/scratch/databases/mariadb55-client/work/mariadb-5.5.52/client/mysql.cc:2644:73: warning: invalid conversion from 'int (*)(int, int)' to 'int (*)(const char*, int)' [-fpermissive]
   rl_add_defun("magic-space", (rl_command_func_t *)&fake_magic_space, -1);
                                                                         ^
client/CMakeFiles/mysql.dir/build.make:86: recipe for target 'client/CMakeFiles/mysql.dir/mysql.cc.o' failed
gmake[2]: *** [client/CMakeFiles/mysql.dir/mysql.cc.o] Error 1
gmake[2]: *** Waiting for unfinished jobs....
Scanning dependencies of target mysqlshow
[ 93%] Building C object client/CMakeFiles/mysqlshow.dir/mysqlshow.c.o
[ 93%] Linking CXX executable mysqlshow
CMakeFiles/Makefile2:1722: recipe for target 'client/CMakeFiles/mysql.dir/all' failed
gmake[1]: *** [client/CMakeFiles/mysql.dir/all] Error 2
gmake[1]: *** Waiting for unfinished jobs....
[ 93%] Linking CXX executable mysqlcheck
[ 93%] Built target mysqlcheck
[ 93%] Built target mysqlshow
[ 94%] Linking CXX executable mysqltest
[ 94%] Built target mysqltest
Makefile:149: recipe for target 'all' failed
gmake: *** [all] Error 2
*** Error code 2

Stop.
make[1]: stopped in /data/pkgsrc-current/databases/mariadb55-client
*** Error code 1

Stop.
make: stopped in /data/pkgsrc-current/databases/mariadb55-client