=> Bootstrap dependency digest>=20010302: found digest-20160304
===> Skipping vulnerability checks.
WARNING: No /var/db/pkg/pkg-vulnerabilities file found.
WARNING: To fix run: `/usr/sbin/pkg_admin -K /var/db/pkg fetch-pkg-vulnerabilities'.
===> Building for libva-driver-vdpau-0.7.4
Making all in debian.upstream
gmake[1]: Entering directory '/data/scratch/multimedia/libva-driver-vdpau/work/vdpau-driver-0.7.4/debian.upstream'
sed \
  -e 's|\@PACKAGE_VERSION\@|0.7.4|' \
  -e 's|\@LIBVA_PACKAGE_VERSION\@|1.0.3|' \
  -e 's|\@LIBVA_DRIVERS_PATH\@|/usr/X11R7/lib/dri:/usr/pkg/lib/dri|' \
  -e 's|\@DATE\@|'"`LC_ALL=C date +'%a, %d %b %Y %X %z'`"'|' \
  changelog.in > changelog
sed \
  -e 's|\@PACKAGE_VERSION\@|0.7.4|' \
  -e 's|\@LIBVA_PACKAGE_VERSION\@|1.0.3|' \
  -e 's|\@LIBVA_DRIVERS_PATH\@|/usr/X11R7/lib/dri:/usr/pkg/lib/dri|' \
  -e 's|\@DATE\@|'"`LC_ALL=C date +'%a, %d %b %Y %X %z'`"'|' \
  control.in > control
sed \
  -e 's|\@PACKAGE_VERSION\@|0.7.4|' \
  -e 's|\@LIBVA_PACKAGE_VERSION\@|1.0.3|' \
  -e 's|\@LIBVA_DRIVERS_PATH\@|/usr/X11R7/lib/dri:/usr/pkg/lib/dri|' \
  -e 's|\@DATE\@|'"`LC_ALL=C date +'%a, %d %b %Y %X %z'`"'|' \
  libva-vdpau-driver.install.in > libva-vdpau-driver.install
gmake[1]: Leaving directory '/data/scratch/multimedia/libva-driver-vdpau/work/vdpau-driver-0.7.4/debian.upstream'
Making all in src
gmake[1]: Entering directory '/data/scratch/multimedia/libva-driver-vdpau/work/vdpau-driver-0.7.4/src'
/usr/pkg/bin/gmake  all-am
gmake[2]: Entering directory '/data/scratch/multimedia/libva-driver-vdpau/work/vdpau-driver-0.7.4/src'
  CC       debug.lo
  CC       ulist.lo
  CC       uasyncqueue.lo
  CC       object_heap.lo
  CC       uqueue.lo
  CC       utils.lo
  CC       vdpau_buffer.lo
  CC       vdpau_decode.lo
  CC       vdpau_driver.lo
  CC       vdpau_dump.lo
  CC       vdpau_gate.lo
vdpau_dump.c: In function 'string_of_VABufferType':
vdpau_dump.c:62:11: error: 'VAEncH264VUIBufferType' undeclared (first use in this function)
         _(VAEncH264VUIBufferType);
           ^
vdpau_dump.c:45:19: note: in definition of macro '_'
 #define _(X) case X: str = #X; break
                   ^
vdpau_dump.c:62:11: note: each undeclared identifier is reported only once for each function it appears in
         _(VAEncH264VUIBufferType);
           ^
vdpau_dump.c:45:19: note: in definition of macro '_'
 #define _(X) case X: str = #X; break
                   ^
vdpau_dump.c:63:11: error: 'VAEncH264SEIBufferType' undeclared (first use in this function)
         _(VAEncH264SEIBufferType);
           ^
vdpau_dump.c:45:19: note: in definition of macro '_'
 #define _(X) case X: str = #X; break
                   ^
Makefile:557: recipe for target 'vdpau_dump.lo' failed
gmake[2]: *** [vdpau_dump.lo] Error 1
gmake[2]: *** Waiting for unfinished jobs....
vdpau_decode.c: In function 'vdpau_EndPicture':
vdpau_decode.c:1295:9: error: invalid use of void expression
         );
         ^
Makefile:557: recipe for target 'vdpau_decode.lo' failed
gmake[2]: *** [vdpau_decode.lo] Error 1
gmake[2]: Leaving directory '/data/scratch/multimedia/libva-driver-vdpau/work/vdpau-driver-0.7.4/src'
Makefile:429: recipe for target 'all' failed
gmake[1]: *** [all] Error 2
gmake[1]: Leaving directory '/data/scratch/multimedia/libva-driver-vdpau/work/vdpau-driver-0.7.4/src'
Makefile:397: recipe for target 'all-recursive' failed
gmake: *** [all-recursive] Error 1
*** Error code 2

Stop.
make[1]: stopped in /data/pkgsrc-current/multimedia/libva-driver-vdpau
*** Error code 1

Stop.
make: stopped in /data/pkgsrc-current/multimedia/libva-driver-vdpau