=> Bootstrap dependency digest>=20010302: found digest-20160304
WARNING: [license.mk] Every package should define a LICENSE.
===> Skipping vulnerability checks.
WARNING: No /var/db/pkg/pkg-vulnerabilities file found.
WARNING: To fix run: `/usr/sbin/pkg_admin -K /var/db/pkg fetch-pkg-vulnerabilities'.
===> Building for fuse-encfs-1.2.0.2nb5
cd . && /bin/sh /data/scratch/filesystems/fuse-encfs/work/encfs-1.2.0/missing --run aclocal-1.9 -I m4
WARNING: 'aclocal' is missing on your system.  You should only need it if
         you modified 'acinclude.m4' or 'configure.ac'.  You might want
         to install the Automake and Perl packages.  Grab them from
         any GNU archive site.
cd . && /bin/sh /data/scratch/filesystems/fuse-encfs/work/encfs-1.2.0/missing --run autoconf
 cd . && /bin/sh /data/scratch/filesystems/fuse-encfs/work/encfs-1.2.0/missing --run automake-1.9 --foreign 
WARNING: 'automake' is missing on your system.  You should only need it if
         you modified 'Makefile.am', 'acinclude.m4' or 'configure.ac'.
         You might want to install the Automake and Perl packages.
         Grab them from any GNU archive site.
configure.ac:14: warning: AC_CACHE_VAL(lt_prog_compiler_static_works, ...): suspicious cache-id, must contain _cv_ to be cached
../../lib/autoconf/general.m4:2031: AC_CACHE_VAL is expanded from...
../../lib/autoconf/general.m4:2052: AC_CACHE_CHECK is expanded from...
aclocal.m4:602: AC_LIBTOOL_LINKER_OPTION is expanded from...
aclocal.m4:2483: _LT_AC_LANG_C_CONFIG is expanded from...
aclocal.m4:2482: AC_LIBTOOL_LANG_C_CONFIG is expanded from...
aclocal.m4:86: AC_LIBTOOL_SETUP is expanded from...
aclocal.m4:66: _AC_PROG_LIBTOOL is expanded from...
aclocal.m4:31: AC_PROG_LIBTOOL is expanded from...
aclocal.m4:5884: AM_PROG_LIBTOOL is expanded from...
configure.ac:14: the top level
configure.ac:14: warning: AC_CACHE_VAL(lt_prog_compiler_pic_works, ...): suspicious cache-id, must contain _cv_ to be cached
../../lib/autoconf/general.m4:2031: AC_CACHE_VAL is expanded from...
../../lib/autoconf/general.m4:2052: AC_CACHE_CHECK is expanded from...
aclocal.m4:559: AC_LIBTOOL_COMPILER_OPTION is expanded from...
aclocal.m4:4525: AC_LIBTOOL_PROG_COMPILER_PIC is expanded from...
aclocal.m4:2483: _LT_AC_LANG_C_CONFIG is expanded from...
aclocal.m4:2482: AC_LIBTOOL_LANG_C_CONFIG is expanded from...
aclocal.m4:86: AC_LIBTOOL_SETUP is expanded from...
aclocal.m4:66: _AC_PROG_LIBTOOL is expanded from...
aclocal.m4:31: AC_PROG_LIBTOOL is expanded from...
aclocal.m4:5884: AM_PROG_LIBTOOL is expanded from...
configure.ac:14: the top level
configure.ac:14: warning: AC_LANG_CONFTEST: no AC_LANG_SOURCE call detected in body
../../lib/autoconf/lang.m4:193: AC_LANG_CONFTEST is expanded from...
../../lib/autoconf/general.m4:2661: _AC_LINK_IFELSE is expanded from...
../../lib/autoconf/general.m4:2678: AC_LINK_IFELSE is expanded from...
aclocal.m4:249: _LT_AC_SYS_LIBPATH_AIX is expanded from...
aclocal.m4:5007: AC_LIBTOOL_PROG_LD_SHLIBS is expanded from...
aclocal.m4:2483: _LT_AC_LANG_C_CONFIG is expanded from...
aclocal.m4:2482: AC_LIBTOOL_LANG_C_CONFIG is expanded from...
aclocal.m4:86: AC_LIBTOOL_SETUP is expanded from...
aclocal.m4:66: _AC_PROG_LIBTOOL is expanded from...
aclocal.m4:31: AC_PROG_LIBTOOL is expanded from...
aclocal.m4:5884: AM_PROG_LIBTOOL is expanded from...
configure.ac:14: the top level
configure.ac:14: warning: AC_LANG_CONFTEST: no AC_LANG_SOURCE call detected in body
../../lib/autoconf/lang.m4:193: AC_LANG_CONFTEST is expanded from...
../../lib/autoconf/general.m4:2661: _AC_LINK_IFELSE is expanded from...
../../lib/autoconf/general.m4:2678: AC_LINK_IFELSE is expanded from...
aclocal.m4:249: _LT_AC_SYS_LIBPATH_AIX is expanded from...
aclocal.m4:2587: _LT_AC_LANG_CXX_CONFIG is expanded from...
aclocal.m4:2586: AC_LIBTOOL_LANG_CXX_CONFIG is expanded from...
aclocal.m4:1637: _LT_AC_TAGCONFIG is expanded from...
aclocal.m4:86: AC_LIBTOOL_SETUP is expanded from...
aclocal.m4:66: _AC_PROG_LIBTOOL is expanded from...
aclocal.m4:31: AC_PROG_LIBTOOL is expanded from...
aclocal.m4:5884: AM_PROG_LIBTOOL is expanded from...
configure.ac:14: the top level
configure.ac:14: warning: AC_CACHE_VAL(lt_prog_compiler_pic_works_CXX, ...): suspicious cache-id, must contain _cv_ to be cached
../../lib/autoconf/general.m4:2031: AC_CACHE_VAL is expanded from...
../../lib/autoconf/general.m4:2052: AC_CACHE_CHECK is expanded from...
aclocal.m4:559: AC_LIBTOOL_COMPILER_OPTION is expanded from...
aclocal.m4:4525: AC_LIBTOOL_PROG_COMPILER_PIC is expanded from...
aclocal.m4:2587: _LT_AC_LANG_CXX_CONFIG is expanded from...
aclocal.m4:2586: AC_LIBTOOL_LANG_CXX_CONFIG is expanded from...
aclocal.m4:1637: _LT_AC_TAGCONFIG is expanded from...
aclocal.m4:86: AC_LIBTOOL_SETUP is expanded from...
aclocal.m4:66: _AC_PROG_LIBTOOL is expanded from...
aclocal.m4:31: AC_PROG_LIBTOOL is expanded from...
aclocal.m4:5884: AM_PROG_LIBTOOL is expanded from...
configure.ac:14: the top level
configure.ac:14: warning: AC_CACHE_VAL(lt_prog_compiler_pic_works_F77, ...): suspicious cache-id, must contain _cv_ to be cached
../../lib/autoconf/general.m4:2031: AC_CACHE_VAL is expanded from...
../../lib/autoconf/general.m4:2052: AC_CACHE_CHECK is expanded from...
aclocal.m4:559: AC_LIBTOOL_COMPILER_OPTION is expanded from...
aclocal.m4:4525: AC_LIBTOOL_PROG_COMPILER_PIC is expanded from...
aclocal.m4:3650: _LT_AC_LANG_F77_CONFIG is expanded from...
aclocal.m4:3649: AC_LIBTOOL_LANG_F77_CONFIG is expanded from...
aclocal.m4:1637: _LT_AC_TAGCONFIG is expanded from...
aclocal.m4:86: AC_LIBTOOL_SETUP is expanded from...
aclocal.m4:66: _AC_PROG_LIBTOOL is expanded from...
aclocal.m4:31: AC_PROG_LIBTOOL is expanded from...
aclocal.m4:5884: AM_PROG_LIBTOOL is expanded from...
configure.ac:14: the top level
configure.ac:14: warning: AC_CACHE_VAL(lt_prog_compiler_pic_works_GCJ, ...): suspicious cache-id, must contain _cv_ to be cached
../../lib/autoconf/general.m4:2031: AC_CACHE_VAL is expanded from...
../../lib/autoconf/general.m4:2052: AC_CACHE_CHECK is expanded from...
aclocal.m4:559: AC_LIBTOOL_COMPILER_OPTION is expanded from...
aclocal.m4:4525: AC_LIBTOOL_PROG_COMPILER_PIC is expanded from...
aclocal.m4:3750: _LT_AC_LANG_GCJ_CONFIG is expanded from...
aclocal.m4:3749: AC_LIBTOOL_LANG_GCJ_CONFIG is expanded from...
aclocal.m4:1637: _LT_AC_TAGCONFIG is expanded from...
aclocal.m4:86: AC_LIBTOOL_SETUP is expanded from...
aclocal.m4:66: _AC_PROG_LIBTOOL is expanded from...
aclocal.m4:31: AC_PROG_LIBTOOL is expanded from...
aclocal.m4:5884: AM_PROG_LIBTOOL is expanded from...
configure.ac:14: the top level
configure.ac:14: warning: AC_LANG_CONFTEST: no AC_LANG_SOURCE call detected in body
../../lib/autoconf/lang.m4:193: AC_LANG_CONFTEST is expanded from...
../../lib/autoconf/general.m4:2661: _AC_LINK_IFELSE is expanded from...
../../lib/autoconf/general.m4:2678: AC_LINK_IFELSE is expanded from...
aclocal.m4:249: _LT_AC_SYS_LIBPATH_AIX is expanded from...
aclocal.m4:5007: AC_LIBTOOL_PROG_LD_SHLIBS is expanded from...
aclocal.m4:3750: _LT_AC_LANG_GCJ_CONFIG is expanded from...
aclocal.m4:3749: AC_LIBTOOL_LANG_GCJ_CONFIG is expanded from...
aclocal.m4:1637: _LT_AC_TAGCONFIG is expanded from...
aclocal.m4:86: AC_LIBTOOL_SETUP is expanded from...
aclocal.m4:66: _AC_PROG_LIBTOOL is expanded from...
aclocal.m4:31: AC_PROG_LIBTOOL is expanded from...
aclocal.m4:5884: AM_PROG_LIBTOOL is expanded from...
configure.ac:14: the top level
/bin/sh ./config.status --recheck
 cd . && /bin/sh ./config.status Makefile 
config.status: creating Makefile
/bin/sh ./config.status --recheck
cd . && /bin/sh /data/scratch/filesystems/fuse-encfs/work/encfs-1.2.0/missing --run autoheader
configure.ac:14: warning: AC_CACHE_VAL(lt_prog_compiler_static_works, ...): suspicious cache-id, must contain _cv_ to be cached
../../lib/autoconf/general.m4:2031: AC_CACHE_VAL is expanded from...
../../lib/autoconf/general.m4:2052: AC_CACHE_CHECK is expanded from...
aclocal.m4:602: AC_LIBTOOL_LINKER_OPTION is expanded from...
aclocal.m4:2483: _LT_AC_LANG_C_CONFIG is expanded from...
aclocal.m4:2482: AC_LIBTOOL_LANG_C_CONFIG is expanded from...
aclocal.m4:86: AC_LIBTOOL_SETUP is expanded from...
aclocal.m4:66: _AC_PROG_LIBTOOL is expanded from...
aclocal.m4:31: AC_PROG_LIBTOOL is expanded from...
aclocal.m4:5884: AM_PROG_LIBTOOL is expanded from...
configure.ac:14: the top level
configure.ac:14: warning: AC_CACHE_VAL(lt_prog_compiler_pic_works, ...): suspicious cache-id, must contain _cv_ to be cached
../../lib/autoconf/general.m4:2031: AC_CACHE_VAL is expanded from...
../../lib/autoconf/general.m4:2052: AC_CACHE_CHECK is expanded from...
aclocal.m4:559: AC_LIBTOOL_COMPILER_OPTION is expanded from...
aclocal.m4:4525: AC_LIBTOOL_PROG_COMPILER_PIC is expanded from...
aclocal.m4:2483: _LT_AC_LANG_C_CONFIG is expanded from...
aclocal.m4:2482: AC_LIBTOOL_LANG_C_CONFIG is expanded from...
aclocal.m4:86: AC_LIBTOOL_SETUP is expanded from...
aclocal.m4:66: _AC_PROG_LIBTOOL is expanded from...
aclocal.m4:31: AC_PROG_LIBTOOL is expanded from...
aclocal.m4:5884: AM_PROG_LIBTOOL is expanded from...
configure.ac:14: the top level
configure.ac:14: warning: AC_LANG_CONFTEST: no AC_LANG_SOURCE call detected in body
../../lib/autoconf/lang.m4:193: AC_LANG_CONFTEST is expanded from...
../../lib/autoconf/general.m4:2661: _AC_LINK_IFELSE is expanded from...
../../lib/autoconf/general.m4:2678: AC_LINK_IFELSE is expanded from...
aclocal.m4:249: _LT_AC_SYS_LIBPATH_AIX is expanded from...
aclocal.m4:5007: AC_LIBTOOL_PROG_LD_SHLIBS is expanded from...
aclocal.m4:2483: _LT_AC_LANG_C_CONFIG is expanded from...
aclocal.m4:2482: AC_LIBTOOL_LANG_C_CONFIG is expanded from...
aclocal.m4:86: AC_LIBTOOL_SETUP is expanded from...
aclocal.m4:66: _AC_PROG_LIBTOOL is expanded from...
aclocal.m4:31: AC_PROG_LIBTOOL is expanded from...
aclocal.m4:5884: AM_PROG_LIBTOOL is expanded from...
configure.ac:14: the top level
configure.ac:14: warning: AC_LANG_CONFTEST: no AC_LANG_SOURCE call detected in body
../../lib/autoconf/lang.m4:193: AC_LANG_CONFTEST is expanded from...
../../lib/autoconf/general.m4:2661: _AC_LINK_IFELSE is expanded from...
../../lib/autoconf/general.m4:2678: AC_LINK_IFELSE is expanded from...
aclocal.m4:249: _LT_AC_SYS_LIBPATH_AIX is expanded from...
aclocal.m4:2587: _LT_AC_LANG_CXX_CONFIG is expanded from...
aclocal.m4:2586: AC_LIBTOOL_LANG_CXX_CONFIG is expanded from...
aclocal.m4:1637: _LT_AC_TAGCONFIG is expanded from...
aclocal.m4:86: AC_LIBTOOL_SETUP is expanded from...
aclocal.m4:66: _AC_PROG_LIBTOOL is expanded from...
aclocal.m4:31: AC_PROG_LIBTOOL is expanded from...
aclocal.m4:5884: AM_PROG_LIBTOOL is expanded from...
configure.ac:14: the top level
configure.ac:14: warning: AC_CACHE_VAL(lt_prog_compiler_pic_works_CXX, ...): suspicious cache-id, must contain _cv_ to be cached
../../lib/autoconf/general.m4:2031: AC_CACHE_VAL is expanded from...
../../lib/autoconf/general.m4:2052: AC_CACHE_CHECK is expanded from...
aclocal.m4:559: AC_LIBTOOL_COMPILER_OPTION is expanded from...
aclocal.m4:4525: AC_LIBTOOL_PROG_COMPILER_PIC is expanded from...
aclocal.m4:2587: _LT_AC_LANG_CXX_CONFIG is expanded from...
aclocal.m4:2586: AC_LIBTOOL_LANG_CXX_CONFIG is expanded from...
aclocal.m4:1637: _LT_AC_TAGCONFIG is expanded from...
aclocal.m4:86: AC_LIBTOOL_SETUP is expanded from...
aclocal.m4:66: _AC_PROG_LIBTOOL is expanded from...
aclocal.m4:31: AC_PROG_LIBTOOL is expanded from...
aclocal.m4:5884: AM_PROG_LIBTOOL is expanded from...
configure.ac:14: the top level
configure.ac:14: warning: AC_CACHE_VAL(lt_prog_compiler_pic_works_F77, ...): suspicious cache-id, must contain _cv_ to be cached
../../lib/autoconf/general.m4:2031: AC_CACHE_VAL is expanded from...
../../lib/autoconf/general.m4:2052: AC_CACHE_CHECK is expanded from...
aclocal.m4:559: AC_LIBTOOL_COMPILER_OPTION is expanded from...
aclocal.m4:4525: AC_LIBTOOL_PROG_COMPILER_PIC is expanded from...
aclocal.m4:3650: _LT_AC_LANG_F77_CONFIG is expanded from...
aclocal.m4:3649: AC_LIBTOOL_LANG_F77_CONFIG is expanded from...
aclocal.m4:1637: _LT_AC_TAGCONFIG is expanded from...
aclocal.m4:86: AC_LIBTOOL_SETUP is expanded from...
aclocal.m4:66: _AC_PROG_LIBTOOL is expanded from...
aclocal.m4:31: AC_PROG_LIBTOOL is expanded from...
aclocal.m4:5884: AM_PROG_LIBTOOL is expanded from...
configure.ac:14: the top level
configure.ac:14: warning: AC_CACHE_VAL(lt_prog_compiler_pic_works_GCJ, ...): suspicious cache-id, must contain _cv_ to be cached
../../lib/autoconf/general.m4:2031: AC_CACHE_VAL is expanded from...
../../lib/autoconf/general.m4:2052: AC_CACHE_CHECK is expanded from...
aclocal.m4:559: AC_LIBTOOL_COMPILER_OPTION is expanded from...
aclocal.m4:4525: AC_LIBTOOL_PROG_COMPILER_PIC is expanded from...
aclocal.m4:3750: _LT_AC_LANG_GCJ_CONFIG is expanded from...
aclocal.m4:3749: AC_LIBTOOL_LANG_GCJ_CONFIG is expanded from...
aclocal.m4:1637: _LT_AC_TAGCONFIG is expanded from...
aclocal.m4:86: AC_LIBTOOL_SETUP is expanded from...
aclocal.m4:66: _AC_PROG_LIBTOOL is expanded from...
aclocal.m4:31: AC_PROG_LIBTOOL is expanded from...
aclocal.m4:5884: AM_PROG_LIBTOOL is expanded from...
configure.ac:14: the top level
configure.ac:14: warning: AC_LANG_CONFTEST: no AC_LANG_SOURCE call detected in body
../../lib/autoconf/lang.m4:193: AC_LANG_CONFTEST is expanded from...
../../lib/autoconf/general.m4:2661: _AC_LINK_IFELSE is expanded from...
../../lib/autoconf/general.m4:2678: AC_LINK_IFELSE is expanded from...
aclocal.m4:249: _LT_AC_SYS_LIBPATH_AIX is expanded from...
aclocal.m4:5007: AC_LIBTOOL_PROG_LD_SHLIBS is expanded from...
aclocal.m4:3750: _LT_AC_LANG_GCJ_CONFIG is expanded from...
aclocal.m4:3749: AC_LIBTOOL_LANG_GCJ_CONFIG is expanded from...
aclocal.m4:1637: _LT_AC_TAGCONFIG is expanded from...
aclocal.m4:86: AC_LIBTOOL_SETUP is expanded from...
aclocal.m4:66: _AC_PROG_LIBTOOL is expanded from...
aclocal.m4:31: AC_PROG_LIBTOOL is expanded from...
aclocal.m4:5884: AM_PROG_LIBTOOL is expanded from...
configure.ac:14: the top level
rm -f stamp-h1
touch config.h.in
cd . && /bin/sh ./config.status config.h
config.status: creating config.h
/usr/pkg/bin/gmake  all-recursive
gmake[1]: Entering directory '/data/scratch/filesystems/fuse-encfs/work/encfs-1.2.0'
/bin/sh ./config.status --recheck
Making all in encfs
gmake[2]: Entering directory '/data/scratch/filesystems/fuse-encfs/work/encfs-1.2.0/encfs'
cd .. && /usr/pkg/bin/gmake  am--refresh
gmake[3]: Entering directory '/data/scratch/filesystems/fuse-encfs/work/encfs-1.2.0'
/bin/sh ./config.status --recheck
gmake[3]: Leaving directory '/data/scratch/filesystems/fuse-encfs/work/encfs-1.2.0'
 cd .. && /bin/sh ./config.status encfs/Makefile depfiles
config.status: creating encfs/Makefile
config.status: executing depfiles commands
cd .. && /usr/pkg/bin/gmake  am--refresh
gmake[3]: Entering directory '/data/scratch/filesystems/fuse-encfs/work/encfs-1.2.0'
/bin/sh ./config.status --recheck
gmake[3]: Leaving directory '/data/scratch/filesystems/fuse-encfs/work/encfs-1.2.0'
if c++ -DHAVE_CONFIG_H -I. -I. -I..  -I../intl  -D_NETBSD_SOURCE -I/usr/pkg/include -I/usr/include  -D_FILE_OFFSET_BITS=64 -DFUSE_USE_VERSION=22 -DRLOG_COMPONENT="encfs" -I/usr/pkg/include      -W -Wall -Wshadow -Wpointer-arith -Wwrite-strings -O2 -D_KERNTYPES -D_NETBSD_SOURCE -I/usr/pkg/include -I/usr/include  -pthread   -MT Ptr.o -MD -MP -MF ".deps/Ptr.Tpo" -c -o Ptr.o Ptr.cpp; \
then mv -f ".deps/Ptr.Tpo" ".deps/Ptr.Po"; else rm -f ".deps/Ptr.Tpo"; exit 1; fi
if c++ -DHAVE_CONFIG_H -I. -I. -I..  -I../intl  -D_NETBSD_SOURCE -I/usr/pkg/include -I/usr/include  -D_FILE_OFFSET_BITS=64 -DFUSE_USE_VERSION=22 -DRLOG_COMPONENT="encfs" -I/usr/pkg/include      -W -Wall -Wshadow -Wpointer-arith -Wwrite-strings -O2 -D_KERNTYPES -D_NETBSD_SOURCE -I/usr/pkg/include -I/usr/include  -pthread   -MT PtrImpl.o -MD -MP -MF ".deps/PtrImpl.Tpo" -c -o PtrImpl.o PtrImpl.cpp; \
then mv -f ".deps/PtrImpl.Tpo" ".deps/PtrImpl.Po"; else rm -f ".deps/PtrImpl.Tpo"; exit 1; fi
if c++ -DHAVE_CONFIG_H -I. -I. -I..  -I../intl  -D_NETBSD_SOURCE -I/usr/pkg/include -I/usr/include  -D_FILE_OFFSET_BITS=64 -DFUSE_USE_VERSION=22 -DRLOG_COMPONENT="encfs" -I/usr/pkg/include      -W -Wall -Wshadow -Wpointer-arith -Wwrite-strings -O2 -D_KERNTYPES -D_NETBSD_SOURCE -I/usr/pkg/include -I/usr/include  -pthread   -MT OpaqueValue.o -MD -MP -MF ".deps/OpaqueValue.Tpo" -c -o OpaqueValue.o OpaqueValue.cpp; \
then mv -f ".deps/OpaqueValue.Tpo" ".deps/OpaqueValue.Po"; else rm -f ".deps/OpaqueValue.Tpo"; exit 1; fi
if c++ -DHAVE_CONFIG_H -I. -I. -I..  -I../intl  -D_NETBSD_SOURCE -I/usr/pkg/include -I/usr/include  -D_FILE_OFFSET_BITS=64 -DFUSE_USE_VERSION=22 -DRLOG_COMPONENT="encfs" -I/usr/pkg/include      -W -Wall -Wshadow -Wpointer-arith -Wwrite-strings -O2 -D_KERNTYPES -D_NETBSD_SOURCE -I/usr/pkg/include -I/usr/include  -pthread   -MT readpassphrase.o -MD -MP -MF ".deps/readpassphrase.Tpo" -c -o readpassphrase.o readpassphrase.cpp; \
then mv -f ".deps/readpassphrase.Tpo" ".deps/readpassphrase.Po"; else rm -f ".deps/readpassphrase.Tpo"; exit 1; fi
if c++ -DHAVE_CONFIG_H -I. -I. -I..  -I../intl  -D_NETBSD_SOURCE -I/usr/pkg/include -I/usr/include  -D_FILE_OFFSET_BITS=64 -DFUSE_USE_VERSION=22 -DRLOG_COMPONENT="encfs" -I/usr/pkg/include      -W -Wall -Wshadow -Wpointer-arith -Wwrite-strings -O2 -D_KERNTYPES -D_NETBSD_SOURCE -I/usr/pkg/include -I/usr/include  -pthread   -MT base64.o -MD -MP -MF ".deps/base64.Tpo" -c -o base64.o base64.cpp; \
then mv -f ".deps/base64.Tpo" ".deps/base64.Po"; else rm -f ".deps/base64.Tpo"; exit 1; fi
if c++ -DHAVE_CONFIG_H -I. -I. -I..  -I../intl  -D_NETBSD_SOURCE -I/usr/pkg/include -I/usr/include  -D_FILE_OFFSET_BITS=64 -DFUSE_USE_VERSION=22 -DRLOG_COMPONENT="encfs" -I/usr/pkg/include      -W -Wall -Wshadow -Wpointer-arith -Wwrite-strings -O2 -D_KERNTYPES -D_NETBSD_SOURCE -I/usr/pkg/include -I/usr/include  -pthread   -MT Config.o -MD -MP -MF ".deps/Config.Tpo" -c -o Config.o Config.cpp; \
then mv -f ".deps/Config.Tpo" ".deps/Config.Po"; else rm -f ".deps/Config.Tpo"; exit 1; fi
if c++ -DHAVE_CONFIG_H -I. -I. -I..  -I../intl  -D_NETBSD_SOURCE -I/usr/pkg/include -I/usr/include  -D_FILE_OFFSET_BITS=64 -DFUSE_USE_VERSION=22 -DRLOG_COMPONENT="encfs" -I/usr/pkg/include      -W -Wall -Wshadow -Wpointer-arith -Wwrite-strings -O2 -D_KERNTYPES -D_NETBSD_SOURCE -I/usr/pkg/include -I/usr/include  -pthread   -MT ConfigVar.o -MD -MP -MF ".deps/ConfigVar.Tpo" -c -o ConfigVar.o ConfigVar.cpp; \
then mv -f ".deps/ConfigVar.Tpo" ".deps/ConfigVar.Po"; else rm -f ".deps/ConfigVar.Tpo"; exit 1; fi
if c++ -DHAVE_CONFIG_H -I. -I. -I..  -I../intl  -D_NETBSD_SOURCE -I/usr/pkg/include -I/usr/include  -D_FILE_OFFSET_BITS=64 -DFUSE_USE_VERSION=22 -DRLOG_COMPONENT="encfs" -I/usr/pkg/include      -W -Wall -Wshadow -Wpointer-arith -Wwrite-strings -O2 -D_KERNTYPES -D_NETBSD_SOURCE -I/usr/pkg/include -I/usr/include  -pthread   -MT Cipher.o -MD -MP -MF ".deps/Cipher.Tpo" -c -o Cipher.o Cipher.cpp; \
then mv -f ".deps/Cipher.Tpo" ".deps/Cipher.Po"; else rm -f ".deps/Cipher.Tpo"; exit 1; fi
if c++ -DHAVE_CONFIG_H -I. -I. -I..  -I../intl  -D_NETBSD_SOURCE -I/usr/pkg/include -I/usr/include  -D_FILE_OFFSET_BITS=64 -DFUSE_USE_VERSION=22 -DRLOG_COMPONENT="encfs" -I/usr/pkg/include      -W -Wall -Wshadow -Wpointer-arith -Wwrite-strings -O2 -D_KERNTYPES -D_NETBSD_SOURCE -I/usr/pkg/include -I/usr/include  -pthread   -MT LinkedOwner.o -MD -MP -MF ".deps/LinkedOwner.Tpo" -c -o LinkedOwner.o LinkedOwner.cpp; \
then mv -f ".deps/LinkedOwner.Tpo" ".deps/LinkedOwner.Po"; else rm -f ".deps/LinkedOwner.Tpo"; exit 1; fi
if c++ -DHAVE_CONFIG_H -I. -I. -I..  -I../intl  -D_NETBSD_SOURCE -I/usr/pkg/include -I/usr/include  -D_FILE_OFFSET_BITS=64 -DFUSE_USE_VERSION=22 -DRLOG_COMPONENT="encfs" -I/usr/pkg/include      -W -Wall -Wshadow -Wpointer-arith -Wwrite-strings -O2 -D_KERNTYPES -D_NETBSD_SOURCE -I/usr/pkg/include -I/usr/include  -pthread   -MT FileIO.o -MD -MP -MF ".deps/FileIO.Tpo" -c -o FileIO.o FileIO.cpp; \
then mv -f ".deps/FileIO.Tpo" ".deps/FileIO.Po"; else rm -f ".deps/FileIO.Tpo"; exit 1; fi
In file included from Cipher.h:27:0,
                 from Cipher.cpp:19:
Ptr.h: In instantiation of 'class rel::Ptr<Cipher>':
Cipher.cpp:101:55:   required from here
Ptr.h:155:2: error: cannot allocate an object of abstract type 'Cipher'
  Ptr(Type value, void *noDestructor)
  ^
In file included from Cipher.cpp:19:0:
Cipher.h:43:7: note:   because the following virtual functions are pure within 'Cipher':
 class Cipher
       ^
Cipher.h:85:28: note: 	virtual rel::Interface Cipher::interface() const
     virtual rel::Interface interface() const =0;
                            ^
Cipher.h:88:23: note: 	virtual CipherKey Cipher::newKey(const char*, int)
     virtual CipherKey newKey(const char *password, int passwdLength) =0;
                       ^
Cipher.h:90:23: note: 	virtual CipherKey Cipher::newRandomKey()
     virtual CipherKey newRandomKey() =0;
                       ^
Cipher.h:93:23: note: 	virtual CipherKey Cipher::readKey(const unsigned char*, const CipherKey&, bool)
     virtual CipherKey readKey(const unsigned char *data, 
                       ^
Cipher.h:96:18: note: 	virtual void Cipher::writeKey(const CipherKey&, unsigned char*, const CipherKey&)
     virtual void writeKey(const CipherKey &key, unsigned char *data, 
                  ^
Cipher.h:99:18: note: 	virtual bool Cipher::compareKey(const CipherKey&, const CipherKey&) const
     virtual bool compareKey( const CipherKey &A, const CipherKey &B ) const =0;
                  ^
Cipher.h:102:17: note: 	virtual int Cipher::keySize() const
     virtual int keySize() const=0;
                 ^
Cipher.h:103:17: note: 	virtual int Cipher::encodedKeySize() const
     virtual int encodedKeySize() const=0; // size 
                 ^
Cipher.h:104:17: note: 	virtual int Cipher::cipherBlockSize() const
     virtual int cipherBlockSize() const=0; // size of a cipher block
                 ^
Cipher.h:109:18: note: 	virtual void Cipher::randomize(unsigned char*, int) const
     virtual void randomize( unsigned char *buf, int len ) const =0;
                  ^
Cipher.h:112:22: note: 	virtual __uint64_t Cipher::MAC_64(const unsigned char*, int, const CipherKey&, __uint64_t*) const
     virtual uint64_t MAC_64( const unsigned char *src, int len,
                      ^
Cipher.h:124:18: note: 	virtual bool Cipher::streamEncode(unsigned char*, int, __uint64_t, const CipherKey&) const
     virtual bool streamEncode( unsigned char *data, int len, 
                  ^
Cipher.h:126:18: note: 	virtual bool Cipher::streamDecode(unsigned char*, int, __uint64_t, const CipherKey&) const
     virtual bool streamDecode( unsigned char *data, int len, 
                  ^
Cipher.h:144:18: note: 	virtual bool Cipher::blockEncode(unsigned char*, int, __uint64_t, const CipherKey&) const
     virtual bool blockEncode(unsigned char *buf, int size, 
                  ^
Cipher.h:146:18: note: 	virtual bool Cipher::blockDecode(unsigned char*, int, __uint64_t, const CipherKey&) const
     virtual bool blockDecode(unsigned char *buf, int size, 
                  ^
In file included from Cipher.h:27:0,
                 from Cipher.cpp:19:
Ptr.h:176:6: error: cannot allocate an object of abstract type 'Cipher'
      Ptr(Type value, void(*destructor)(Type))
      ^
In file included from Cipher.cpp:19:0:
Cipher.h:43:7: note:   since type 'Cipher' has pure virtual functions
 class Cipher
       ^
In file included from Cipher.h:27:0,
                 from Cipher.cpp:19:
Ptr.h:245:7: error: cannot allocate an object of abstract type 'Cipher'
  void reset(Type value, void(*destructor)(Type))
       ^
In file included from Cipher.cpp:19:0:
Cipher.h:43:7: note:   since type 'Cipher' has pure virtual functions
 class Cipher
       ^
Makefile:512: recipe for target 'Cipher.o' failed
gmake[2]: *** [Cipher.o] Error 1
gmake[2]: *** Waiting for unfinished jobs....
gmake[2]: Leaving directory '/data/scratch/filesystems/fuse-encfs/work/encfs-1.2.0/encfs'
Makefile:302: recipe for target 'all-recursive' failed
gmake[1]: *** [all-recursive] Error 1
gmake[1]: Leaving directory '/data/scratch/filesystems/fuse-encfs/work/encfs-1.2.0'
Makefile:227: recipe for target 'all' failed
gmake: *** [all] Error 2
*** Error code 2

Stop.
make[1]: stopped in /data/pkgsrc-current/filesystems/fuse-encfs
*** Error code 1

Stop.
make: stopped in /data/pkgsrc-current/filesystems/fuse-encfs